• Status: Solved
  • Priority: Medium
  • Security: Public
  • Views: 232
  • Last Modified:

problem compiling HTTPD-2.0.36

i am getting the following error while compiling HTTPD-2.0.36 on slackaware 10.1
how can i fix it?

make[4]: *** [apr_dbm_berkeleydb.lo] Error 1
make[4]: Leaving directory `/root/php_apache/httpd-2.0.36/srclib/apr-util/dbm'
make[3]: *** [all-recursive] Error 1
make[3]: Leaving directory `/root/php_apache/httpd-2.0.36/srclib/apr-util/dbm'
make[2]: *** [all-recursive] Error 1
make[2]: Leaving directory `/root/php_apache/httpd-2.0.36/srclib/apr-util'
make[1]: *** [all-recursive] Error 1
make[1]: Leaving directory `/root/php_apache/httpd-2.0.36/srclib'
make: *** [all-recursive] Error 1
root@Jeudy_Rionel:~/php_apache/httpd-2.0.36# Leaving directory `/root/php_apache/httpd-2.0.36/srclib/apr-util/dbm'
> make[3]: *** [all-recursive] Error 1

Please help

thank you
0
247RealMedia
Asked:
247RealMedia
1 Solution
 
Gabriel OrozcoSolution ArchitectCommented:
I think you need to download and install te berkeley db package

look for the package db on your slackware or download it from ftp.slackware.at
0

Featured Post

Keep up with what's happening at Experts Exchange!

Sign up to receive Decoded, a new monthly digest with product updates, feature release info, continuing education opportunities, and more.

Tackle projects and never again get stuck behind a technical roadblock.
Join Now