LINK : fatal error LNK1104: cannot open file.....in VC8

I am compiling a SLN in VC8

It compiles all projects without errors..when it reaches the last project I get the following error :;

LINK : fatal error LNK1104: cannot open file 'c:\Documents and Settings\xxxxxxx\Desktop\resiprocate\tfm\..\contrib\openssl\lib\vc\libeay32.lib'
Build log was saved at "file://c:\Documents and Settings\xxxxxxx\Desktop\resiprocate\tfm\Debug\BuildLog.htm"
sanityTests - 1 error(s), 0 warning(s)
========== Rebuild All: 8 succeeded, 1 failed, 0 skipped ==========
LVL 19
http:// thevpn.guruAsked:
Who is Participating?
I wear a lot of hats...

"The solutions and answers provided on Experts Exchange have been extremely helpful to me over the last few years. I wear a lot of hats - Developer, Database Administrator, Help Desk, etc., so I know a lot of things but not a lot about one thing. Experts Exchange gives me answers from people who do know a lot about one thing, in a easy to use platform." -Todd S.

Infinity08Commented:
>> cannot open file 'c:\Documents and Settings\xxxxxxx\Desktop\resiprocate\tfm\..\contrib\openssl\lib\vc\libeay32.lib'

Does that file exist ?
0
evilrixSenior Software Engineer (Avast)Commented:
And presumably you've checked to see if this .lib file exists in this path? If not have you tried searching for it to ensure your project settings are , indeed, correct and looking for it in the right place?
0
http:// thevpn.guruAuthor Commented:
Well this lib exists

'c:\Documents and Settings\xxxxxxx\Desktop\resiprocate\tfm\..\contrib\openssl\lib\vc\

I have downloaded openssl but the lib file only contains

libeay32MDd.lib and libeay32xxx.lib files and no file named
libeay32.lib
0
Cloud Class® Course: Amazon Web Services - Basic

Are you thinking about creating an Amazon Web Services account for your business? Not sure where to start? In this course you’ll get an overview of the history of AWS and take a tour of their user interface.

evilrixSenior Software Engineer (Avast)Commented:
Try renaming  libeay32xxx.lib  to  libeay32.lib
0
http:// thevpn.guruAuthor Commented:
I searched my system and found the file in


\contrib\openssl\lib\builder5\

However I am compiling a SLN for VC8
0
http:// thevpn.guruAuthor Commented:
This file exists

libeay32MD.lib

and

libeay32MDd.lib
libeay32MT.lib
libeay32MTd.lib

All same size ..which one should I rename ?
0
evilrixSenior Software Engineer (Avast)Commented:
Choose your weapon, below are what the extensions probably mean...

libeay32MD.lib - Multi-threaded DLL
libeay32MDd.lib - Multi-threaded debug DLL
libeay32MT.lib - Multi-threaded static
libeay32MTd.lib - Multi-threaded debug static

0
evilrixSenior Software Engineer (Avast)Commented:
The name extensions are taken from the compiler option used when linking with the C/C++ Runtime.

/MD
 Creates a multithreaded DLL using MSVCRT.lib.
 
/MDd
 Creates a debug multithreaded DLL using MSVCRTD.lib.
 
/MT
 Creates a multithreaded executable file using LIBCMT.lib.
 
/MTd
 Creates a debug multithreaded executable file using LIBCMTD.lib.
 
0
Infinity08Commented:
I wouldn't rename the lib though ... Rather modify the include path.
0
evilrixSenior Software Engineer (Avast)Commented:
>> Rather modify the include path.
I was only suggesting it as a quick check to see if it resolved the issue. I should have made that clearer. Yes, you should ensure your project is set up correctly to use the correct library -- once you know which it is :)
0
Infinity08Commented:
btw :

    c:\Documents and Settings\xxxxxxx\Desktop\resiprocate\tfm\..\contrib\openssl\lib\vc\libeay32.lib

do you have a directory that is actually named .. ? If so, that's not good. The .. means go to the directory one level higher. So the above path is equivalent to :

    c:\Documents and Settings\xxxxxxx\Desktop\resiprocate\contrib\openssl\lib\vc\libeay32.lib
0
http:// thevpn.guruAuthor Commented:
Thanks for your comments I did try

libeay32MDd.lib - Multi-threaded debug DLL
and
libeay32MTd.lib - Multi-threaded debug static

since I am making my build in debug mode both gave the output below
1>sanityTests.obj : error LNK2019: unresolved external symbol "class std::basic_ostream<char,struct std::char_traits<char> > & __cdecl resip::operator<<(class std::basic_ostream<char,struct std::char_traits<char> > &,class resip::BaseException const &)" (??6resip@@YAAAV?$basic_ostream@DU?$char_traits@D@std@@@std@@AAV12@ABVBaseException@0@@Z) referenced in function __catch$_main$0
1>sanityTests.obj : error LNK2019: unresolved external symbol "public: virtual __thiscall CppUnit::TextTestRunner::~TextTestRunner(void)" (??1TextTestRunner@CppUnit@@UAE@XZ) referenced in function _main
1>sanityTests.obj : error LNK2019: unresolved external symbol "public: static void __cdecl Fixture::destroyStatic(void)" (?destroyStatic@Fixture@@SAXXZ) referenced in function _main
1>sanityTests.obj : error LNK2019: unresolved external symbol "public: __thiscall resip::Log::Guard::~Guard(void)" (??1Guard@Log@resip@@QAE@XZ) referenced in function _main
1>sanityTests.obj : error LNK2019: unresolved external symbol "public: __thiscall resip::Log::Guard::Guard(enum resip::Log::Level,class resip::Subsystem const &,char const *,int)" (??0Guard@Log@resip@@QAE@W4Level@12@ABVSubsystem@2@PBDH@Z) referenced in function _main
1>sanityTests.obj : error LNK2019: unresolved external symbol "bool __cdecl genericLogCheckLevel(enum resip::Log::Level,class resip::Subsystem const &)" (?genericLogCheckLevel@@YA_NW4Level@Log@resip@@ABVSubsystem@3@@Z) referenced in function _main
1>sanityTests.obj : error LNK2001: unresolved external symbol "public: static class resip::Subsystem resip::Subsystem::TEST" (?TEST@Subsystem@resip@@2V12@A)
1>sanityTests.obj : error LNK2019: unresolved external symbol "public: bool __thiscall CppUnit::TextTestRunner::run(class std::basic_string<char,struct std::char_traits<char>,class std::allocator<char> >,bool,bool,bool)" (?run@TextTestRunner@CppUnit@@QAE_NV?$basic_string@DU?$char_traits@D@std@@V?$allocator@D@2@@std@@_N11@Z) referenced in function _main
1>sanityTests.obj : error LNK2019: unresolved external symbol "public: virtual void __thiscall CppUnit::TestRunner::addTest(class CppUnit::Test *)" (?addTest@TestRunner@CppUnit@@UAEXPAVTest@2@@Z) referenced in function _main
1>sanityTests.obj : error LNK2019: unresolved external symbol "public: __thiscall CppUnit::TextTestRunner::TextTestRunner(class CppUnit::Outputter *)" (??0TextTestRunner@CppUnit@@QAE@PAVOutputter@1@@Z) referenced in function _main
1>sanityTests.obj : error LNK2019: unresolved external symbol "public: static void __cdecl Fixture::initialize(class CommandLineParser &)" (?initialize@Fixture@@SAXAAVCommandLineParser@@@Z) referenced in function _main
1>sanityTests.obj : error LNK2001: unresolved external symbol "public: static unsigned long resip::Timer::T100" (?T100@Timer@resip@@2KA)
1>sanityTests.obj : error LNK2019: unresolved external symbol "public: __thiscall resip::Data::~Data(void)" (??1Data@resip@@QAE@XZ) referenced in function _main
1>sanityTests.obj : error LNK2019: unresolved external symbol "public: static void __cdecl resip::Log::initialize(class resip::Data const &,class resip::Data const &,class resip::Data const &,char const *,class resip::ExternalLogger *)" (?initialize@Log@resip@@SAXABVData@2@00PBDPAVExternalLogger@2@@Z) referenced in function _main
1>sanityTests.obj : error LNK2019: unresolved external symbol "public: __thiscall resip::Data::Data(char const *)" (??0Data@resip@@QAE@PBD@Z) referenced in function _main
1>sanityTests.obj : error LNK2019: unresolved external symbol "public: __thiscall CommandLineParser::CommandLineParser(int,char * *)" (??0CommandLineParser@@QAE@HPAPAD@Z) referenced in function _main
1>sanityTests.obj : error LNK2019: unresolved external symbol "void __cdecl resip::initNetwork(void)" (?initNetwork@resip@@YAXXZ) referenced in function _main
1>sanityTests.obj : error LNK2019: unresolved external symbol "public: void __thiscall CppUnit::TestSuite::addTest(class CppUnit::Test *)" (?addTest@TestSuite@CppUnit@@QAEXPAVTest@2@@Z) referenced in function "public: static class CppUnit::Test * __cdecl MyTestCase::suite(void)" (?suite@MyTestCase@@SAPAVTest@CppUnit@@XZ)
1>sanityTests.obj : error LNK2019: unresolved external symbol "public: __thiscall CppUnit::TestSuite::TestSuite(class std::basic_string<char,struct std::char_traits<char>,class std::allocator<char> >)" (??0TestSuite@CppUnit@@QAE@V?$basic_string@DU?$char_traits@D@std@@V?$allocator@D@2@@std@@@Z) referenced in function "public: static class CppUnit::Test * __cdecl MyTestCase::suite(void)" (?suite@MyTestCase@@SAPAVTest@CppUnit@@XZ)
1>sanityTests.obj : error LNK2019: unresolved external symbol "public: virtual __thiscall CppUnit::SourceLine::~SourceLine(void)" (??1SourceLine@CppUnit@@UAE@XZ) referenced in function "public: void __thiscall TestHolder::testRegisterBasic(void)" (?testRegisterBasic@TestHolder@@QAEXXZ)
1>sanityTests.obj : error LNK2019: unresolved external symbol "public: static void __cdecl CppUnit::Asserter::failIf(bool,class std::basic_string<char,struct std::char_traits<char>,class std::allocator<char> >,class CppUnit::SourceLine const &)" (?failIf@Asserter@CppUnit@@SAX_NV?$basic_string@DU?$char_traits@D@std@@V?$allocator@D@2@@std@@ABVSourceLine@2@@Z) referenced in function "public: void __thiscall TestHolder::testRegisterBasic(void)" (?testRegisterBasic@TestHolder@@QAEXXZ)
1>sanityTests.obj : error LNK2019: unresolved external symbol "public: char const * __thiscall resip::Data::c_str(void)const " (?c_str@Data@resip@@QBEPBDXZ) referenced in function "public: void __thiscall TestHolder::testRegisterBasic(void)" (?testRegisterBasic@TestHolder@@QAEXXZ)
1>sanityTests.obj : error LNK2019: unresolved external symbol "public: __thiscall CppUnit::SourceLine::SourceLine(class std::basic_string<char,struct std::char_traits<char>,class std::allocator<char> > const &,int)" (??0SourceLine@CppUnit@@QAE@ABV?$basic_string@DU?$char_traits@D@std@@V?$allocator@D@2@@std@@H@Z) referenced in function "public: void __thiscall TestHolder::testRegisterBasic(void)" (?testRegisterBasic@TestHolder@@QAEXXZ)
1>sanityTests.obj : error LNK2019: unresolved external symbol "public: bool __thiscall SequenceSet::exec(void)" (?exec@SequenceSet@@QAE_NXZ) referenced in function "public: void __thiscall TestHolder::testRegisterBasic(void)" (?testRegisterBasic@TestHolder@@QAEXXZ)
1>sanityTests.obj : error LNK2019: unresolved external symbol "public: void __thiscall SequenceSet::outputToInfo(void)" (?outputToInfo@SequenceSet@@QAEXXZ) referenced in function "public: void __thiscall TestHolder::testRegisterBasic(void)" (?testRegisterBasic@TestHolder@@QAEXXZ)
1>sanityTests.obj : error LNK2001: unresolved external symbol "public: static class boost::shared_ptr<class SequenceSet> SequenceClass::CPUSequenceSet" (?CPUSequenceSet@SequenceClass@@2V?$shared_ptr@VSequenceSet@@@boost@@A)
1>sanityTests.obj : error LNK2001: unresolved external symbol "public: static bool SequenceClass::CPUSequenceSetCleanup" (?CPUSequenceSetCleanup@SequenceClass@@2_NA)
1>sanityTests.obj : error LNK2019: unresolved external symbol "class SequenceClass * __cdecl Seq(class ActionBase *,class TestEndPoint::ExpectBase *,class TestEndPoint::ExpectBase *,unsigned int)" (?Seq@@YAPAVSequenceClass@@PAVActionBase@@PAVExpectBase@TestEndPoint@@1I@Z) referenced in function "public: void __thiscall TestHolder::testRegisterBasic(void)" (?testRegisterBasic@TestHolder@@QAEXXZ)
1>sanityTests.obj : error LNK2019: unresolved external symbol "public: class TestUser::Register * __thiscall TestUser::registerUser(int,class std::set<class resip::NameAddr,struct std::less<class resip::NameAddr>,class std::allocator<class resip::NameAddr> > const &)" (?registerUser@TestUser@@QAEPAVRegister@1@HABV?$set@VNameAddr@resip@@U?$less@VNameAddr@resip@@@std@@V?$allocator@VNameAddr@resip@@@4@@std@@@Z) referenced in function "public: void __thiscall TestHolder::testRegisterBasic(void)" (?testRegisterBasic@TestHolder@@QAEXXZ)
1>sanityTests.obj : error LNK2019: unresolved external symbol "public: class TestSipEndPoint::MessageExpectAction * __thiscall TestUser::digestRespond(void)" (?digestRespond@TestUser@@QAEPAVMessageExpectAction@TestSipEndPoint@@XZ) referenced in function "public: void __thiscall TestHolder::testRegisterBasic(void)" (?testRegisterBasic@TestHolder@@QAEXXZ)
1>sanityTests.obj : error LNK2019: unresolved external symbol "public: class TestEndPoint::ExpectBase * __thiscall TestSipEndPoint::expect(struct std::pair<enum resip::MethodTypes,int>,class TestSipEndPoint::Matcher *,int,class ActionBase *)" (?expect@TestSipEndPoint@@QAEPAVExpectBase@TestEndPoint@@U?$pair@W4MethodTypes@resip@@H@std@@PAVMatcher@1@HPAVActionBase@@@Z) referenced in function "public: void __thiscall TestHolder::testRegisterBasic(void)" (?testRegisterBasic@TestHolder@@QAEXXZ)
1>sanityTests.obj : error LNK2019: unresolved external symbol "struct std::pair<enum resip::MethodTypes,int> __cdecl operator/(enum resip::MethodTypes,int)" (??K@YA?AU?$pair@W4MethodTypes@resip@@H@std@@W4MethodTypes@resip@@H@Z) referenced in function "public: void __thiscall TestHolder::testRegisterBasic(void)" (?testRegisterBasic@TestHolder@@QAEXXZ)
1>sanityTests.obj : error LNK2019: unresolved external symbol "class TestSipEndPoint::From * __cdecl from(class TestProxy *)" (?from@@YAPAVFrom@TestSipEndPoint@@PAVTestProxy@@@Z) referenced in function "public: void __thiscall TestHolder::testRegisterBasic(void)" (?testRegisterBasic@TestHolder@@QAEXXZ)
1>sanityTests.obj : error LNK2001: unresolved external symbol "public: static class TestProxy * Fixture::proxy" (?proxy@Fixture@@2PAVTestProxy@@A)
1>sanityTests.obj : error LNK2019: unresolved external symbol "public: __thiscall CheckContacts::CheckContacts(class std::set<class resip::NameAddr,struct std::less<class resip::NameAddr>,class std::allocator<class resip::NameAddr> > const &,int)" (??0CheckContacts@@QAE@ABV?$set@VNameAddr@resip@@U?$less@VNameAddr@resip@@@std@@V?$allocator@VNameAddr@resip@@@4@@std@@H@Z) referenced in function "public: void __thiscall TestHolder::testRegisterBasic(void)" (?testRegisterBasic@TestHolder@@QAEXXZ)
1>sanityTests.obj : error LNK2019: unresolved external symbol "public: class std::set<class resip::NameAddr,struct std::less<class resip::NameAddr>,class std::allocator<class resip::NameAddr> > const & __thiscall TestSipEndPoint::getDefaultContacts(void)const " (?getDefaultContacts@TestSipEndPoint@@QBEABV?$set@VNameAddr@resip@@U?$less@VNameAddr@resip@@@std@@V?$allocator@VNameAddr@resip@@@4@@std@@XZ) referenced in function "public: void __thiscall TestHolder::testRegisterBasic(void)" (?testRegisterBasic@TestHolder@@QAEXXZ)
1>sanityTests.obj : error LNK2001: unresolved external symbol "public: static class TestUser * Fixture::jason" (?jason@Fixture@@2PAVTestUser@@A)
1>sanityTests.obj : error LNK2019: unresolved external symbol "public: __thiscall resip::Data::Data(class resip::Data const &)" (??0Data@resip@@QAE@ABV01@@Z) referenced in function "public: class resip::Data __thiscall SequenceSet::getExplanation(void)const " (?getExplanation@SequenceSet@@QBE?AVData@resip@@XZ)
1>sanityTests.obj : error LNK2019: unresolved external symbol "class std::set<class resip::NameAddr,struct std::less<class resip::NameAddr>,class std::allocator<class resip::NameAddr> > __cdecl mergeContacts(class TestUser const &,class TestUser const &)" (?mergeContacts@@YA?AV?$set@VNameAddr@resip@@U?$less@VNameAddr@resip@@@std@@V?$allocator@VNameAddr@resip@@@4@@std@@ABVTestUser@@0@Z) referenced in function "public: void __thiscall TestHolder::testMultiple1(void)" (?testMultiple1@TestHolder@@QAEXXZ)
1>sanityTests.obj : error LNK2001: unresolved external symbol "public: static class TestUser * Fixture::derek" (?derek@Fixture@@2PAVTestUser@@A)
1>sanityTests.obj : error LNK2019: unresolved external symbol "public: virtual __thiscall resip::NameAddr::~NameAddr(void)" (??1NameAddr@resip@@UAE@XZ) referenced in function "public: void __thiscall TestHolder::testMixedExpires(void)" (?testMixedExpires@TestHolder@@QAEXXZ)
1>sanityTests.obj : error LNK2019: unresolved external symbol "public: unsigned int & __thiscall resip::ParserCategory::param(class resip::expires_Param const &)" (?param@ParserCategory@resip@@QAEAAIABVexpires_Param@2@@Z) referenced in function "public: void __thiscall TestHolder::testMixedExpires(void)" (?testMixedExpires@TestHolder@@QAEXXZ)
1>sanityTests.obj : error LNK2001: unresolved external symbol "class resip::expires_Param resip::p_expires" (?p_expires@resip@@3Vexpires_Param@1@A)
1>sanityTests.obj : error LNK2019: unresolved external symbol "public: __thiscall resip::NameAddr::NameAddr(class resip::NameAddr const &)" (??0NameAddr@resip@@QAE@ABV01@@Z) referenced in function "public: void __thiscall TestHolder::testMixedExpires(void)" (?testMixedExpires@TestHolder@@QAEXXZ)
1>sanityTests.obj : error LNK2019: unresolved external symbol "public: class TestUser::Register * __thiscall TestUser::registerUser(int,class resip::NameAddr const &)" (?registerUser@TestUser@@QAEPAVRegister@1@HABVNameAddr@resip@@@Z) referenced in function "public: void __thiscall TestHolder::testDetailsQValue(void)" (?testDetailsQValue@TestHolder@@QAEXXZ)
1>sanityTests.obj : error LNK2019: unresolved external symbol "class SequenceClass * __cdecl Seq(class ActionBase *,class TestEndPoint::ExpectBase *,class TestEndPoint::ExpectBase *,class TestEndPoint::ExpectBase *,unsigned int)" (?Seq@@YAPAVSequenceClass@@PAVActionBase@@PAVExpectBase@TestEndPoint@@11I@Z) referenced in function "public: void __thiscall TestHolder::testRegister407Dropped(void)" (?testRegister407Dropped@TestHolder@@QAEXXZ)
1>sanityTests.obj : error LNK2019: unresolved external symbol "class TestSipEndPoint::MessageAction * __cdecl save(class boost::shared_ptr<class resip::SipMessage> &,class TestSipEndPoint::MessageAction *)" (?save@@YAPAVMessageAction@TestSipEndPoint@@AAV?$shared_ptr@VSipMessage@resip@@@boost@@PAV12@@Z) referenced in function "public: void __thiscall TestHolder::testRegister407Dropped(void)" (?testRegister407Dropped@TestHolder@@QAEXXZ)
1>sanityTests.obj : error LNK2019: unresolved external symbol "public: class TestSipEndPoint::Retransmit * __thiscall TestSipEndPoint::retransmit(class boost::shared_ptr<class resip::SipMessage> &)" (?retransmit@TestSipEndPoint@@QAEPAVRetransmit@1@AAV?$shared_ptr@VSipMessage@resip@@@boost@@@Z) referenced in function "public: void __thiscall TestHolder::testRegister407Dropped(void)" (?testRegister407Dropped@TestHolder@@QAEXXZ)
1>sanityTests.obj : error LNK2019: unresolved external symbol "class TestSipEndPoint::MessageExpectAction * __cdecl condition(class boost::function<class boost::shared_ptr<class resip::SipMessage> __cdecl(class boost::shared_ptr<class resip::SipMessage>),class std::allocator<void> >,class TestSipEndPoint::MessageExpectAction *)" (?condition@@YAPAVMessageExpectAction@TestSipEndPoint@@V?$function@$$A6A?AV?$shared_ptr@VSipMessage@resip@@@boost@@V12@@ZV?$allocator@X@std@@@boost@@PAV12@@Z) referenced in function "public: void __thiscall TestHolder::testRegisterBogusAuth(void)" (?testRegisterBogusAuth@TestHolder@@QAEXXZ)
1>sanityTests.obj : error LNK2019: unresolved external symbol "public: class ExpectAction * __thiscall TestEndPoint::noAction(void)" (?noAction@TestEndPoint@@QAEPAVExpectAction@@XZ) referenced in function "public: void __thiscall TestHolder::testRegisterBogusAuth(void)" (?testRegisterBogusAuth@TestHolder@@QAEXXZ)
1>sanityTests.obj : error LNK2019: unresolved external symbol "public: class resip::Data & __thiscall resip::Data::operator=(char const *)" (??4Data@resip@@QAEAAV01@PBD@Z) referenced in function "public: static class boost::shared_ptr<class resip::SipMessage> __cdecl TestHolder::bogusAuth(class boost::shared_ptr<class resip::SipMessage>)" (?bogusAuth@TestHolder@@SA?AV?$shared_ptr@VSipMessage@resip@@@boost@@V23@@Z)
1>sanityTests.obj : error LNK2019: unresolved external symbol "public: class resip::Data & __thiscall resip::Auth::param(class resip::response_Param const &)" (?param@Auth@resip@@QAEAAVData@2@ABVresponse_Param@2@@Z) referenced in function "public: static class boost::shared_ptr<class resip::SipMessage> __cdecl TestHolder::bogusAuth(class boost::shared_ptr<class resip::SipMessage>)" (?bogusAuth@TestHolder@@SA?AV?$shared_ptr@VSipMessage@resip@@@boost@@V23@@Z)
1>sanityTests.obj : error LNK2001: unresolved external symbol "class resip::response_Param resip::p_response" (?p_response@resip@@3Vresponse_Param@1@A)
1>sanityTests.obj : error LNK2019: unresolved external symbol "public: class resip::ParserContainer<class resip::Auth> & __thiscall resip::SipMessage::header(class resip::H_ProxyAuthorizations const &)" (?header@SipMessage@resip@@QAEAAV?$ParserContainer@VAuth@resip@@@2@ABVH_ProxyAuthorizations@2@@Z) referenced in function "public: static class boost::shared_ptr<class resip::SipMessage> __cdecl TestHolder::bogusAuth(class boost::shared_ptr<class resip::SipMessage>)" (?bogusAuth@TestHolder@@SA?AV?$shared_ptr@VSipMessage@resip@@@boost@@V23@@Z)
1>sanityTests.obj : error LNK2019: unresolved external symbol "public: bool __thiscall resip::SipMessage::exists(class resip::HeaderBase const &)const " (?exists@SipMessage@resip@@QBE_NABVHeaderBase@2@@Z) referenced in function "public: static class boost::shared_ptr<class resip::SipMessage> __cdecl TestHolder::bogusAuth(class boost::shared_ptr<class resip::SipMessage>)" (?bogusAuth@TestHolder@@SA?AV?$shared_ptr@VSipMessage@resip@@@boost@@V23@@Z)
1>sanityTests.obj : error LNK2001: unresolved external symbol "class resip::H_ProxyAuthorizations resip::h_ProxyAuthorizations" (?h_ProxyAuthorizations@resip@@3VH_ProxyAuthorizations@1@A)
1>sanityTests.obj : error LNK2019: unresolved external symbol "class TestEndPoint::ExpectBase * __cdecl optional(class TestEndPoint::ExpectBase *)" (?optional@@YAPAVExpectBase@TestEndPoint@@PAV12@@Z) referenced in function "public: void __thiscall TestHolder::testRefresh(void)" (?testRefresh@TestHolder@@QAEXXZ)
1>sanityTests.obj : error LNK2019: unresolved external symbol "public: class resip::QValue & __thiscall resip::ParserCategory::param(class resip::q_Param const &)" (?param@ParserCategory@resip@@QAEAAVQValue@2@ABVq_Param@2@@Z) referenced in function "public: void __thiscall TestHolder::testChangeQValue(void)" (?testChangeQValue@TestHolder@@QAEXXZ)
1>sanityTests.obj : error LNK2001: unresolved external symbol "class resip::q_Param resip::p_q" (?p_q@resip@@3Vq_Param@1@A)
1>sanityTests.obj : error LNK2019: unresolved external symbol "public: __thiscall CheckFetchedContacts::CheckFetchedContacts(class std::set<class resip::NameAddr,struct std::less<class resip::NameAddr>,class std::allocator<class resip::NameAddr> >)" (??0CheckFetchedContacts@@QAE@V?$set@VNameAddr@resip@@U?$less@VNameAddr@resip@@@std@@V?$allocator@VNameAddr@resip@@@4@@std@@@Z) referenced in function "public: void __thiscall TestHolder::testUnregisterAll(void)" (?testUnregisterAll@TestHolder@@QAEXXZ)
1>sanityTests.obj : error LNK2001: unresolved external symbol "public: static class TestUser * Fixture::jason2" (?jason2@Fixture@@2PAVTestUser@@A)
1>sanityTests.obj : error LNK2001: unresolved external symbol "public: static class TestUser * Fixture::jason1" (?jason1@Fixture@@2PAVTestUser@@A)
1>sanityTests.obj : error LNK2019: unresolved external symbol "public: void __thiscall resip::NameAddr::setAllContacts(void)" (?setAllContacts@NameAddr@resip@@QAEXXZ) referenced in function "public: void __thiscall TestHolder::testUnregisterAll(void)" (?testUnregisterAll@TestHolder@@QAEXXZ)
1>sanityTests.obj : error LNK2019: unresolved external symbol "public: __thiscall resip::NameAddr::NameAddr(void)" (??0NameAddr@resip@@QAE@XZ) referenced in function "public: void __thiscall TestHolder::testUnregisterAll(void)" (?testUnregisterAll@TestHolder@@QAEXXZ)
1>sanityTests.obj : error LNK2019: unresolved external symbol "public: class TestSipEndPoint::Invite * __thiscall TestSipEndPoint::invite(class TestUser const &)" (?invite@TestSipEndPoint@@QAEPAVInvite@1@ABVTestUser@@@Z) referenced in function "public: void __thiscall TestHolder::testInviteBasic(void)" (?testInviteBasic@TestHolder@@QAEXXZ)
1>sanityTests.obj : error LNK2019: unresolved external symbol "class TestEndPoint::And * __cdecl And(class SequenceClass *,class SequenceClass *,class ActionBase *)" (?And@@YAPAV0TestEndPoint@@PAVSequenceClass@@0PAVActionBase@@@Z) referenced in function "public: void __thiscall TestHolder::testInviteBasic(void)" (?testInviteBasic@TestHolder@@QAEXXZ)
1>sanityTests.obj : error LNK2019: unresolved external symbol "class SequenceClass * __cdecl Sub(class TestEndPoint::ExpectBase *)" (?Sub@@YAPAVSequenceClass@@PAVExpectBase@TestEndPoint@@@Z) referenced in function "public: void __thiscall TestHolder::testInviteBasic(void)" (?testInviteBasic@TestHolder@@QAEXXZ)
1>sanityTests.obj : error LNK2019: unresolved external symbol "class SequenceClass * __cdecl Sub(class TestEndPoint::ExpectBase *,class TestEndPoint::ExpectBase *,class TestEndPoint::ExpectBase *,class TestEndPoint::ExpectBase *)" (?Sub@@YAPAVSequenceClass@@PAVExpectBase@TestEndPoint@@000@Z) referenced in function "public: void __thiscall TestHolder::testInviteBasic(void)" (?testInviteBasic@TestHolder@@QAEXXZ)
1>sanityTests.obj : error LNK2019: unresolved external symbol "class ActionBase * __cdecl chain(class ActionBase *,class ActionBase *)" (?chain@@YAPAVActionBase@@PAV1@0@Z) referenced in function "public: void __thiscall TestHolder::testInviteBasic(void)" (?testInviteBasic@TestHolder@@QAEXXZ)
1>sanityTests.obj : error LNK2019: unresolved external symbol "public: class TestSipEndPoint::MessageExpectAction * __thiscall TestSipEndPoint::ring(void)" (?ring@TestSipEndPoint@@QAEPAVMessageExpectAction@1@XZ) referenced in function "public: void __thiscall TestHolder::testInviteBasic(void)" (?testInviteBasic@TestHolder@@QAEXXZ)
1>sanityTests.obj : error LNK2019: unresolved external symbol "public: class TestSipEndPoint::MessageExpectAction * __thiscall TestSipEndPoint::answer(void)" (?answer@TestSipEndPoint@@QAEPAVMessageExpectAction@1@XZ) referenced in function "public: void __thiscall TestHolder::testInviteBasic(void)" (?testInviteBasic@TestHolder@@QAEXXZ)
1>sanityTests.obj : error LNK2019: unresolved external symbol "class TestSipEndPoint::Contact * __cdecl contact(class TestSipEndPoint const *)" (?contact@@YAPAVContact@TestSipEndPoint@@PBV2@@Z) referenced in function "public: void __thiscall TestHolder::testInviteBasic(void)" (?testInviteBasic@TestHolder@@QAEXXZ)
1>sanityTests.obj : error LNK2019: unresolved external symbol "public: class TestSipEndPoint::MessageExpectAction * __thiscall TestSipEndPoint::ack(void)" (?ack@TestSipEndPoint@@QAEPAVMessageExpectAction@1@XZ) referenced in function "public: void __thiscall TestHolder::testInviteBasic(void)" (?testInviteBasic@TestHolder@@QAEXXZ)
1>sanityTests.obj : error LNK2019: unresolved external symbol "public: class TestEndPoint::ExpectBase * __thiscall TestSipEndPoint::expect(enum resip::MethodTypes,class TestSipEndPoint::Matcher *,int,class ActionBase *)" (?expect@TestSipEndPoint@@QAEPAVExpectBase@TestEndPoint@@W4MethodTypes@resip@@PAVMatcher@1@HPAVActionBase@@@Z) referenced in function "public: void __thiscall TestHolder::testInviteBasic(void)" (?testInviteBasic@TestHolder@@QAEXXZ)
1>sanityTests.obj : error LNK2019: unresolved external symbol "class TestSipEndPoint::From * __cdecl from(class TestSipEndPoint const *)" (?from@@YAPAVFrom@TestSipEndPoint@@PBV2@@Z) referenced in function "public: void __thiscall TestHolder::testInviteBasic(void)" (?testInviteBasic@TestHolder@@QAEXXZ)
1>sanityTests.obj : error LNK2019: unresolved external symbol "class SequenceClass * __cdecl Sub(class TestEndPoint::ExpectBase *,class TestEndPoint::ExpectBase *,class TestEndPoint::ExpectBase *,class TestEndPoint::ExpectBase *,class TestEndPoint::ExpectBase *,class TestEndPoint::ExpectBase *)" (?Sub@@YAPAVSequenceClass@@PAVExpectBase@TestEndPoint@@00000@Z) referenced in function "public: void __thiscall TestHolder::testInviteCallerHangsUp(void)" (?testInviteCallerHangsUp@TestHolder@@QAEXXZ)
1>sanityTests.obj : error LNK2019: unresolved external symbol "public: class ActionBase * __thiscall TestEndPoint::pause(int)" (?pause@TestEndPoint@@QAEPAVActionBase@@H@Z) referenced in function "public: void __thiscall TestHolder::testInviteCallerHangsUp(void)" (?testInviteCallerHangsUp@TestHolder@@QAEXXZ)
1>sanityTests.obj : error LNK2019: unresolved external symbol "public: class ExpectAction * __thiscall TestSipEndPoint::bye(class TestSipEndPoint const *)" (?bye@TestSipEndPoint@@QAEPAVExpectAction@@PBV1@@Z) referenced in function "public: void __thiscall TestHolder::testInviteCallerHangsUp(void)" (?testInviteCallerHangsUp@TestHolder@@QAEXXZ)
1>sanityTests.obj : error LNK2019: unresolved external symbol "public: class TestSipEndPoint::MessageExpectAction * __thiscall TestSipEndPoint::ok(void)" (?ok@TestSipEndPoint@@QAEPAVMessageExpectAction@1@XZ) referenced in function "public: void __thiscall TestHolder::testInviteCallerHangsUp(void)" (?testInviteCallerHangsUp@TestHolder@@QAEXXZ)
1>sanityTests.obj : error LNK2019: unresolved external symbol "public: class TestSipEndPoint::MessageExpectAction * __thiscall TestSipEndPoint::bye(void)" (?bye@TestSipEndPoint@@QAEPAVMessageExpectAction@1@XZ) referenced in function "public: void __thiscall TestHolder::testInviteCalleeHangsUp(void)" (?testInviteCalleeHangsUp@TestHolder@@QAEXXZ)
1>sanityTests.obj : error LNK2019: unresolved external symbol "class SequenceClass * __cdecl Sub(class TestEndPoint::ExpectBase *,class TestEndPoint::ExpectBase *,class TestEndPoint::ExpectBase *)" (?Sub@@YAPAVSequenceClass@@PAVExpectBase@TestEndPoint@@00@Z) referenced in function "public: void __thiscall TestHolder::testInviteCallerCancels(void)" (?testInviteCallerCancels@TestHolder@@QAEXXZ)
1>sanityTests.obj : error LNK2019: unresolved external symbol "public: class TestSipEndPoint::MessageExpectAction * __thiscall TestSipEndPoint::cancel(void)" (?cancel@TestSipEndPoint@@QAEPAVMessageExpectAction@1@XZ) referenced in function "public: void __thiscall TestHolder::testInviteCallerCancels(void)" (?testInviteCallerCancels@TestHolder@@QAEXXZ)
1>sanityTests.obj : error LNK2019: unresolved external symbol "class SequenceClass * __cdecl Sub(class TestEndPoint::ExpectBase *,class TestEndPoint::ExpectBase *)" (?Sub@@YAPAVSequenceClass@@PAVExpectBase@TestEndPoint@@0@Z) referenced in function "public: void __thiscall TestHolder::testInviteCallerCancels(void)" (?testInviteCallerCancels@TestHolder@@QAEXXZ)
1>sanityTests.obj : error LNK2019: unresolved external symbol "public: class TestSipEndPoint::MessageExpectAction * __thiscall TestSipEndPoint::send487(void)" (?send487@TestSipEndPoint@@QAEPAVMessageExpectAction@1@XZ) referenced in function "public: void __thiscall TestHolder::testInviteCallerCancels(void)" (?testInviteCallerCancels@TestHolder@@QAEXXZ)
1>sanityTests.obj : error LNK2019: unresolved external symbol "public: class TestSipEndPoint::MessageExpectAction * __thiscall TestSipEndPoint::send100(void)" (?send100@TestSipEndPoint@@QAEPAVMessageExpectAction@1@XZ) referenced in function "public: void __thiscall TestHolder::testInviteBusy(void)" (?testInviteBusy@TestHolder@@QAEXXZ)
1>sanityTests.obj : error LNK2019: unresolved external symbol "public: class TestSipEndPoint::MessageExpectAction * __thiscall TestSipEndPoint::send486(void)" (?send486@TestSipEndPoint@@QAEPAVMessageExpectAction@1@XZ) referenced in function "public: void __thiscall TestHolder::testInviteBusy(void)" (?testInviteBusy@TestHolder@@QAEXXZ)
1>sanityTests.obj : error LNK2019: unresolved external symbol "public: __thiscall RouteGuard::~RouteGuard(void)" (??1RouteGuard@@QAE@XZ) referenced in function "public: void __thiscall TestHolder::testSpiral(void)" (?testSpiral@TestHolder@@QAEXXZ)
1>sanityTests.obj : error LNK2019: unresolved external symbol "public: class TestSipEndPoint::Invite * __thiscall TestSipEndPoint::invite(class resip::Uri const &)" (?invite@TestSipEndPoint@@QAEPAVInvite@1@ABVUri@resip@@@Z) referenced in function "public: void __thiscall TestHolder::testSpiral(void)" (?testSpiral@TestHolder@@QAEXXZ)
1>sanityTests.obj : error LNK2019: unresolved external symbol "public: class resip::Uri & __thiscall resip::NameAddr::uri(void)" (?uri@NameAddr@resip@@QAEAAVUri@2@XZ) referenced in function "public: void __thiscall TestHolder::testSpiral(void)" (?testSpiral@TestHolder@@QAEXXZ)
1>sanityTests.obj : error LNK2019: unresolved external symbol "public: class resip::NameAddr __thiscall TestProxy::makeUrl(class resip::Data const &)const " (?makeUrl@TestProxy@@QBE?AVNameAddr@resip@@ABVData@3@@Z) referenced in function "public: void __thiscall TestHolder::testSpiral(void)" (?testSpiral@TestHolder@@QAEXXZ)
1>sanityTests.obj : error LNK2019: unresolved external symbol "public: __thiscall RouteGuard::RouteGuard(class TestProxy &,class resip::Data const &,class resip::Data const &,class resip::Data const &,class resip::Data const &,int,int)" (??0RouteGuard@@QAE@AAVTestProxy@@ABVData@resip@@111HH@Z) referenced in function "public: void __thiscall TestHolder::testSpiral(void)" (?testSpiral@TestHolder@@QAEXXZ)
1>sanityTests.obj : error LNK2019: unresolved external symbol "public: class resip::Data __thiscall TestSipEndPoint::getAddressOfRecordString(void)const " (?getAddressOfRecordString@TestSipEndPoint@@QBE?AVData@resip@@XZ) referenced in function "public: void __thiscall TestHolder::testSpiral(void)" (?testSpiral@TestHolder@@QAEXXZ)
1>sanityTests.obj : error LNK2001: unresolved external symbol "public: static class TestUser * Fixture::david" (?david@Fixture@@2PAVTestUser@@A)
1>sanityTests.obj : error LNK2001: unresolved external symbol "public: static class resip::Data const resip::Data::Empty" (?Empty@Data@resip@@2V12@B)
1>sanityTests.obj : error LNK2019: unresolved external symbol "public: class resip::Data __thiscall resip::Data::operator+(class resip::Data const &)const " (??HData@resip@@QBE?AV01@ABV01@@Z) referenced in function "class resip::Data __cdecl resip::operator+(char const *,class resip::Data const &)" (??Hresip@@YA?AVData@0@PBDABV10@@Z)
1>sanityTests.obj : error LNK2019: unresolved external symbol "class ActionBase * __cdecl chain(class ActionBase *,class ActionBase *,class ActionBase *)" (?chain@@YAPAVActionBase@@PAV1@00@Z) referenced in function "public: void __thiscall TestHolder::testInviteCallerCancelsWithRace(void)" (?testInviteCallerCancelsWithRace@TestHolder@@QAEXXZ)
1>sanityTests.obj : error LNK2019: unresolved external symbol "class TestEndPoint::And * __cdecl And(class SequenceClass *,class SequenceClass *,class SequenceClass *,class SequenceClass *,class ActionBase *)" (?And@@YAPAV0TestEndPoint@@PAVSequenceClass@@000PAVActionBase@@@Z) referenced in function "public: void __thiscall TestHolder::testInvite486BeatsCancelServerSide(void)" (?testInvite486BeatsCancelServerSide@TestHolder@@QAEXXZ)
1>sanityTests.obj : error LNK2019: unresolved external symbol "public: class TestSipEndPoint::MessageExpectAction * __thiscall TestSipEndPoint::send503(void)" (?send503@TestSipEndPoint@@QAEPAVMessageExpectAction@1@XZ) referenced in function "public: void __thiscall TestHolder::testInvite503BeatsCancelServerSide(void)" (?testInvite503BeatsCancelServerSide@TestHolder@@QAEXXZ)
1>sanityTests.obj : error LNK2019: unresolved external symbol "class SequenceClass * __cdecl Seq(class ActionBase *,class TestEndPoint::ExpectBase *,class TestEndPoint::ExpectBase *,class TestEndPoint::ExpectBase *,class TestEndPoint::ExpectBase *,class TestEndPoint::ExpectBase *,class TestEndPoint::ExpectBase *,unsigned int)" (?Seq@@YAPAVSequenceClass@@PAVActionBase@@PAVExpectBase@TestEndPoint@@11111I@Z) referenced in function "public: void __thiscall TestHolder::testInviteCancelBefore1xx(void)" (?testInviteCancelBefore1xx@TestHolder@@QAEXXZ)
1>sanityTests.obj : error LNK2019: unresolved external symbol "class SequenceClass * __cdecl Seq(class ActionBase *,class TestEndPoint::ExpectBase *,class TestEndPoint::ExpectBase *,class TestEndPoint::ExpectBase *,class TestEndPoint::ExpectBase *,class TestEndPoint::ExpectBase *,class TestEndPoint::ExpectBase *,class TestEndPoint::ExpectBase *,class TestEndPoint::ExpectBase *,class TestEndPoint::ExpectBase *,unsigned int)" (?Seq@@YAPAVSequenceClass@@PAVActionBase@@PAVExpectBase@TestEndPoint@@11111111I@Z) referenced in function "public: void __thiscall TestHolder::testInviteCancelBefore1xxNo487or1xx(void)" (?testInviteCancelBefore1xxNo487or1xx@TestHolder@@QAEXXZ)
1>sanityTests.obj : error LNK2019: unresolved external symbol "class SequenceClass * __cdecl Seq(class ActionBase *,class TestEndPoint::ExpectBase *,class TestEndPoint::ExpectBase *,class TestEndPoint::ExpectBase *,class TestEndPoint::ExpectBase *,unsigned int)" (?Seq@@YAPAVSequenceClass@@PAVActionBase@@PAVExpectBase@TestEndPoint@@111I@Z) referenced in function "public: void __thiscall TestHolder::testInviteNotFound(void)" (?testInviteNotFound@TestHolder@@QAEXXZ)
1>sanityTests.obj : error LNK2019: unresolved external symbol "public: class TestSipEndPoint::MessageExpectAction * __thiscall TestSipEndPoint::send488(void)" (?send488@TestSipEndPoint@@QAEPAVMessageExpectAction@1@XZ) referenced in function "public: void __thiscall TestHolder::testInvite488Response(void)" (?testInvite488Response@TestHolder@@QAEXXZ)
1>sanityTests.obj : error LNK2019: unresolved external symbol "public: class TestSipEndPoint::MessageExpectAction * __thiscall TestSipEndPoint::send480(void)" (?send480@TestSipEndPoint@@QAEPAVMessageExpectAction@1@XZ) referenced in function "public: void __thiscall TestHolder::testInvite480Response(void)" (?testInvite480Response@TestHolder@@QAEXXZ)
1>sanityTests.obj : error LNK2019: unresolved external symbol "public: class TestSipEndPoint::MessageExpectAction * __thiscall TestSipEndPoint::send500(void)" (?send500@TestSipEndPoint@@QAEPAVMessageExpectAction@1@XZ) referenced in function "public: void __thiscall TestHolder::testInvite500Response(void)" (?testInvite500Response@TestHolder@@QAEXXZ)
1>sanityTests.obj : error LNK2019: unresolved external symbol "public: class TestSipEndPoint::MessageExpectAction * __thiscall TestSipEndPoint::send600(void)" (?send600@TestSipEndPoint@@QAEPAVMessageExpectAction@1@XZ) referenced in function "public: void __thiscall TestHolder::testInvite600Response(void)" (?testInvite600Response@TestHolder@@QAEXXZ)
1>sanityTests.obj : error LNK2019: unresolved external symbol "public: class TestSipEndPoint::MessageExpectAction * __thiscall TestSipEndPoint::send603(void)" (?send603@TestSipEndPoint@@QAEPAVMessageExpectAction@1@XZ) referenced in function "public: void __thiscall TestHolder::testInvite603Response(void)" (?testInvite603Response@TestHolder@@QAEXXZ)
1>sanityTests.obj : error LNK2019: unresolved external symbol "class ActionBase * __cdecl chain(class ActionBase *,class ActionBase *,class ActionBase *,class ActionBase *)" (?chain@@YAPAVActionBase@@PAV1@000@Z) referenced in function "public: void __thiscall TestHolder::testInviteServerSpams180(void)" (?testInviteServerSpams180@TestHolder@@QAEXXZ)
1>sanityTests.obj : error LNK2001: unresolved external symbol "public: static class TestUser * Fixture::jasonTcp" (?jasonTcp@Fixture@@2PAVTestUser@@A)
1>sanityTests.obj : error LNK2019: unresolved external symbol "class SequenceClass * __cdecl Seq(class ActionBase *,class TestEndPoint::ExpectBase *,class TestEndPoint::ExpectBase *,class TestEndPoint::ExpectBase *,class TestEndPoint::ExpectBase *,class TestEndPoint::ExpectBase *,unsigned int)" (?Seq@@YAPAVSequenceClass@@PAVActionBase@@PAVExpectBase@TestEndPoint@@1111I@Z) referenced in function "public: void __thiscall TestHolder::testInviteRecursiveRedirect(void)" (?testInviteRecursiveRedirect@TestHolder@@QAEXXZ)
1>sanityTests.obj : error LNK2019: unresolved external symbol "public: class TestSipEndPoint::MessageExpectAction * __thiscall TestSipEndPoint::send300(class std::set<class resip::NameAddr,struct std::less<class resip::NameAddr>,class std::allocator<class resip::NameAddr> >)" (?send300@TestSipEndPoint@@QAEPAVMessageExpectAction@1@V?$set@VNameAddr@resip@@U?$less@VNameAddr@resip@@@std@@V?$allocator@VNameAddr@resip@@@4@@std@@@Z) referenced in function "public: void __thiscall TestHolder::testInviteRecursiveRedirect(void)" (?testInviteRecursiveRedirect@TestHolder@@QAEXXZ)
1>sanityTests.obj : error LNK2001: unresolved external symbol "public: static class TestUser * Fixture::cullen" (?cullen@Fixture@@2PAVTestUser@@A)
1>sanityTests.obj : error LNK2019: unresolved external symbol "public: class ActionBase * __thiscall TestEndPoint::note(char const *)" (?note@TestEndPoint@@QAEPAVActionBase@@PBD@Z) referenced in function "public: void __thiscall TestHolder::testInviteClientRetransmissionsWithRecovery(void)" (?testInviteClientRetransmissionsWithRecovery@TestHolder@@QAEXXZ)
1>sanityTests.obj : error LNK2019: unresolved external symbol "class SequenceClass * __cdecl Sub(class TestEndPoint::ExpectBase *,class TestEndPoint::ExpectBase *,class TestEndPoint::ExpectBase *,class TestEndPoint::ExpectBase *,class TestEndPoint::ExpectBase *,class TestEndPoint::ExpectBase *,class TestEndPoint::ExpectBase *)" (?Sub@@YAPAVSequenceClass@@PAVExpectBase@TestEndPoint@@000000@Z) referenced in function "public: void __thiscall TestHolder::testInviteClientLateAck(void)" (?testInviteClientLateAck@TestHolder@@QAEXXZ)
1>sanityTests.obj : error LNK2019: unresolved external symbol "class TestSipEndPoint::MessageExpectAction * __cdecl operator<=(class boost::shared_ptr<class resip::SipMessage> &,class TestSipEndPoint::MessageExpectAction *)" (??N@YAPAVMessageExpectAction@TestSipEndPoint@@AAV?$shared_ptr@VSipMessage@resip@@@boost@@PAV01@@Z) referenced in function "public: void __thiscall TestHolder::testInviteClientLateAck(void)" (?testInviteClientLateAck@TestHolder@@QAEXXZ)
1>sanityTests.obj : error LNK2019: unresolved external symbol "class SequenceClass * __cdecl Sub(class TestEndPoint::ExpectBase *,class TestEndPoint::ExpectBase *,class TestEndPoint::ExpectBase *,class TestEndPoint::ExpectBase *,class TestEndPoint::ExpectBase *)" (?Sub@@YAPAVSequenceClass@@PAVExpectBase@TestEndPoint@@0000@Z) referenced in function "public: void __thiscall TestHolder::testInvite1xxDropped(void)" (?testInvite1xxDropped@TestHolder@@QAEXXZ)
1>sanityTests.obj : error LNK2019: unresolved external symbol "class SequenceClass * __cdecl Seq(class ActionBase *,class TestEndPoint::ExpectBase *,class TestEndPoint::ExpectBase *,class TestEndPoint::ExpectBase *,class TestEndPoint::ExpectBase *,class TestEndPoint::ExpectBase *,class TestEndPoint::ExpectBase *,class TestEndPoint::ExpectBase *,unsigned int)" (?Seq@@YAPAVSequenceClass@@PAVActionBase@@PAVExpectBase@TestEndPoint@@111111I@Z) referenced in function "public: void __thiscall TestHolder::testTimerC(void)" (?testTimerC@TestHolder@@QAEXXZ)
1>sanityTests.obj : error LNK2019: unresolved external symbol "class ActionBase * __cdecl chain(class ActionBase *,class ActionBase *,class ActionBase *,class ActionBase *,class ActionBase *)" (?chain@@YAPAVActionBase@@PAV1@0000@Z) referenced in function "public: void __thiscall TestHolder::testInviteServerSpams200(void)" (?testInviteServerSpams200@TestHolder@@QAEXXZ)
1>sanityTests.obj : error LNK2019: unresolved external symbol "class SequenceClass * __cdecl Seq(class ActionBase *,class TestEndPoint::ExpectBase *,unsigned int)" (?Seq@@YAPAVSequenceClass@@PAVActionBase@@PAVExpectBase@TestEndPoint@@I@Z) referenced in function "public: void __thiscall TestHolder::testInviteClientSpamsInvite(void)" (?testInviteClientSpamsInvite@TestHolder@@QAEXXZ)
1>sanityTests.obj : error LNK2019: unresolved external symbol "class TestSipEndPoint::MessageExpectAction * __cdecl save(class boost::shared_ptr<class resip::SipMessage> &,class TestSipEndPoint::MessageExpectAction *)" (?save@@YAPAVMessageExpectAction@TestSipEndPoint@@AAV?$shared_ptr@VSipMessage@resip@@@boost@@PAV12@@Z) referenced in function "public: void __thiscall TestHolder::testInviteClientSpamsInvite(void)" (?testInviteClientSpamsInvite@TestHolder@@QAEXXZ)
1>sanityTests.obj : error LNK2019: unresolved external symbol "class SequenceClass * __cdecl Seq(class ActionBase *,class TestEndPoint::ExpectBase *,class TestEndPoint::ExpectBase *,class TestEndPoint::ExpectBase *,class TestEndPoint::ExpectBase *,class TestEndPoint::ExpectBase *,class TestEndPoint::ExpectBase *,class TestEndPoint::ExpectBase *,class TestEndPoint::ExpectBase *,class TestEndPoint::ExpectBase *,class TestEndPoint::ExpectBase *,unsigned int)" (?Seq@@YAPAVSequenceClass@@PAVActionBase@@PAVExpectBase@TestEndPoint@@111111111I@Z) referenced in function "public: void __thiscall TestHolder::testInviteClientSpamsAck200(void)" (?testInviteClientSpamsAck200@TestHolder@@QAEXXZ)
1>sanityTests.obj : error LNK2019: unresolved external symbol "public: class TestSipEndPoint::CloseTransport * __thiscall TestSipEndPoint::closeTransport(void)" (?closeTransport@TestSipEndPoint@@QAEPAVCloseTransport@1@XZ) referenced in function "public: void __thiscall TestHolder::testInviteTransportFailure(void)" (?testInviteTransportFailure@TestHolder@@QAEXXZ)
1>sanityTests.obj : error LNK2019: unresolved external symbol "class SequenceClass * __cdecl Seq(class ActionBase *,class TestEndPoint::ExpectBase *,class TestEndPoint::ExpectBase *,class TestEndPoint::ExpectBase *,class TestEndPoint::ExpectBase *,class TestEndPoint::ExpectBase *,class TestEndPoint::ExpectBase *,class TestEndPoint::ExpectBase *,class TestEndPoint::ExpectBase *,class TestEndPoint::ExpectBase *,class TestEndPoint::ExpectBase *,class TestEndPoint::ExpectBase *,class TestEndPoint::ExpectBase *,unsigned int)" (?Seq@@YAPAVSequenceClass@@PAVActionBase@@PAVExpectBase@TestEndPoint@@11111111111I@Z) referenced in function "public: void __thiscall TestHolder::testInviteClientDiesAfterFirstInvite(void)" (?testInviteClientDiesAfterFirstInvite@TestHolder@@QAEXXZ)
1>sanityTests.obj : error LNK2019: unresolved external symbol "class SequenceClass * __cdecl Seq(class ActionBase *,class TestEndPoint::ExpectBase *,class TestEndPoint::ExpectBase *,class TestEndPoint::ExpectBase *,class TestEndPoint::ExpectBase *,class TestEndPoint::ExpectBase *,class TestEndPoint::ExpectBase *,class TestEndPoint::ExpectBase *,class TestEndPoint::ExpectBase *,class TestEndPoint::ExpectBase *,class TestEndPoint::ExpectBase *,class TestEndPoint::ExpectBase *,class TestEndPoint::ExpectBase *,class TestEndPoint::ExpectBase *,class TestEndPoint::ExpectBase *,class TestEndPoint::ExpectBase *,unsigned int)" (?Seq@@YAPAVSequenceClass@@PAVActionBase@@PAVExpectBase@TestEndPoint@@11111111111111I@Z) referenced in function "public: void __thiscall TestHolder::testInviteClientDiesAfterSecondInvite(void)" (?testInviteClientDiesAfterSecondInvite@TestHolder@@QAEXXZ)
1>sanityTests.obj : error LNK2019: unresolved external symbol "class SequenceClass * __cdecl Sub(class TestEndPoint::ExpectBase *,class TestEndPoint::ExpectBase *,class TestEndPoint::ExpectBase *,class TestEndPoint::ExpectBase *,class TestEndPoint::ExpectBase *,class TestEndPoint::ExpectBase *,class TestEndPoint::ExpectBase *,class TestEndPoint::ExpectBase *)" (?Sub@@YAPAVSequenceClass@@PAVExpectBase@TestEndPoint@@0000000@Z) referenced in function "public: void __thiscall TestHolder::testInviteServerDead(void)" (?testInviteServerDead@TestHolder@@QAEXXZ)
1>sanityTests.obj : error LNK2019: unresolved external symbol "class TestSipEndPoint::MessageAction * __cdecl condition(class boost::function<class boost::shared_ptr<class resip::SipMessage> __cdecl(class boost::shared_ptr<class resip::SipMessage>),class std::allocator<void> >,class TestSipEndPoint::MessageAction *)" (?condition@@YAPAVMessageAction@TestSipEndPoint@@V?$function@$$A6A?AV?$shared_ptr@VSipMessage@resip@@@boost@@V12@@ZV?$allocator@X@std@@@boost@@PAV12@@Z) referenced in function "public: void __thiscall TestHolder::testInviteForgedUserInFrom(void)" (?testInviteForgedUserInFrom@TestHolder@@QAEXXZ)
1>sanityTests.obj : error LNK2019: unresolved external symbol "public: class resip::NameAddr & __thiscall resip::SipMessage::header(class resip::H_From const &)" (?header@SipMessage@resip@@QAEAAVNameAddr@2@ABVH_From@2@@Z) referenced in function "public: static class boost::shared_ptr<class resip::SipMessage> __cdecl TestHolder::unknownUserInFrom(class boost::shared_ptr<class resip::SipMessage>)" (?unknownUserInFrom@TestHolder@@SA?AV?$shared_ptr@VSipMessage@resip@@@boost@@V23@@Z)
1>sanityTests.obj : error LNK2001: unresolved external symbol "class resip::H_From resip::h_From" (?h_From@resip@@3VH_From@1@A)
1>sanityTests.obj : error LNK2019: unresolved external symbol "public: void __thiscall resip::LazyParser::checkParsed(void)const " (?checkParsed@LazyParser@resip@@QBEXXZ) referenced in function "public: class resip::Data & __thiscall resip::Uri::user(void)" (?user@Uri@resip@@QAEAAVData@2@XZ)
1>sanityTests.obj : error LNK2019: unresolved external symbol "public: class resip::Data & __thiscall resip::CSeqCategory::unknownMethodName(void)" (?unknownMethodName@CSeqCategory@resip@@QAEAAVData@2@XZ) referenced in function "public: static class boost::shared_ptr<class resip::SipMessage> __cdecl TestHolder::cancelCSeq(class boost::shared_ptr<class resip::SipMessage>)" (?cancelCSeq@TestHolder@@SA?AV?$shared_ptr@VSipMessage@resip@@@boost@@V23@@Z)
1>sanityTests.obj : error LNK2019: unresolved external symbol "public: enum resip::MethodTypes & __thiscall resip::CSeqCategory::method(void)" (?method@CSeqCategory@resip@@QAEAAW4MethodTypes@2@XZ) referenced in function "public: static class boost::shared_ptr<class resip::SipMessage> __cdecl TestHolder::cancelCSeq(class boost::shared_ptr<class resip::SipMessage>)" (?cancelCSeq@TestHolder@@SA?AV?$shared_ptr@VSipMessage@resip@@@boost@@V23@@Z)
1>sanityTests.obj : error LNK2019: unresolved external symbol "public: class resip::CSeqCategory & __thiscall resip::SipMessage::header(class resip::H_CSeq const &)" (?header@SipMessage@resip@@QAEAAVCSeqCategory@2@ABVH_CSeq@2@@Z) referenced in function "public: static class boost::shared_ptr<class resip::SipMessage> __cdecl TestHolder::cancelCSeq(class boost::shared_ptr<class resip::SipMessage>)" (?cancelCSeq@TestHolder@@SA?AV?$shared_ptr@VSipMessage@resip@@@boost@@V23@@Z)
1>sanityTests.obj : error LNK2001: unresolved external symbol "class resip::H_CSeq resip::h_CSeq" (?h_CSeq@resip@@3VH_CSeq@1@A)
1>sanityTests.obj : error LNK2019: unresolved external symbol "public: class TestSipEndPoint::MessageExpectAction * __thiscall TestSipEndPoint::ackOldTid(void)" (?ackOldTid@TestSipEndPoint@@QAEPAVMessageExpectAction@1@XZ) referenced in function "public: void __thiscall TestHolder::testInviteBadAckTid1(void)" (?testInviteBadAckTid1@TestHolder@@QAEXXZ)
1>sanityTests.obj : error LNK2019: unresolved external symbol "public: class TestSipEndPoint::MessageExpectAction * __thiscall TestSipEndPoint::ackNewTid(void)" (?ackNewTid@TestSipEndPoint@@QAEPAVMessageExpectAction@1@XZ) referenced in function "public: void __thiscall TestHolder::testInviteBadAckTid2(void)" (?testInviteBadAckTid2@TestHolder@@QAEXXZ)
1>sanityTests.obj : error LNK2019: unresolved external symbol "public: void __thiscall resip::ParserCategory::remove(class resip::ParamBase const &)" (?remove@ParserCategory@resip@@QAEXABVParamBase@2@@Z) referenced in function "public: static class boost::shared_ptr<class resip::SipMessage> __cdecl TestHolder::missingTid(class boost::shared_ptr<class resip::SipMessage>)" (?missingTid@TestHolder@@SA?AV?$shared_ptr@VSipMessage@resip@@@boost@@V23@@Z)
1>sanityTests.obj : error LNK2019: unresolved external symbol "public: class resip::ParserContainer<class resip::Via> & __thiscall resip::SipMessage::header(class resip::H_Vias const &)" (?header@SipMessage@resip@@QAEAAV?$ParserContainer@VVia@resip@@@2@ABVH_Vias@2@@Z) referenced in function "public: static class boost::shared_ptr<class resip::SipMessage> __cdecl TestHolder::missingTid(class boost::shared_ptr<class resip::SipMessage>)" (?missingTid@TestHolder@@SA?AV?$shared_ptr@VSipMessage@resip@@@boost@@V23@@Z)
1>sanityTests.obj : error LNK2001: unresolved external symbol "class resip::H_Vias resip::h_Vias" (?h_Vias@resip@@3VH_Vias@1@A)
1>sanityTests.obj : error LNK2001: unresolved external symbol "class resip::branch_Param resip::p_branch" (?p_branch@resip@@3Vbranch_Param@1@A)
1>sanityTests.obj : error LNK2019: unresolved external symbol "class TestEndPoint::And * __cdecl And(class SequenceClass *,class SequenceClass *,class SequenceClass *,class ActionBase *)" (?And@@YAPAV0TestEndPoint@@PAVSequenceClass@@00PAVActionBase@@@Z) referenced in function "public: void __thiscall TestHolder::testInviteForkOneAnswers(void)" (?testInviteForkOneAnswers@TestHolder@@QAEXXZ)
1>sanityTests.obj : error LNK2019: unresolved external symbol "class TestEndPoint::And * __cdecl And(class SequenceClass *,class SequenceClass *,class SequenceClass *,class SequenceClass *,class SequenceClass *,class ActionBase *)" (?And@@YAPAV0TestEndPoint@@PAVSequenceClass@@0000PAVActionBase@@@Z) referenced in function "public: void __thiscall TestHolder::testInviteAllBusyContacts(void)" (?testInviteAllBusyContacts@TestHolder@@QAEXXZ)
1>sanityTests.obj : error LNK2019: unresolved external symbol "class std::set<class resip::NameAddr,struct std::less<class resip::NameAddr>,class std::allocator<class resip::NameAddr> > __cdecl mergeContacts(class TestUser const &,class TestUser const &,class TestUser const &)" (?mergeContacts@@YA?AV?$set@VNameAddr@resip@@U?$less@VNameAddr@resip@@@std@@V?$allocator@VNameAddr@resip@@@4@@std@@ABVTestUser@@00@Z) referenced in function "public: void __thiscall TestHolder::testInviteAllBusyContacts(void)" (?testInviteAllBusyContacts@TestHolder@@QAEXXZ)
1>sanityTests.obj : error LNK2001: unresolved external symbol "public: static class TestUser * Fixture::enlai" (?enlai@Fixture@@2PAVTestUser@@A)
1>sanityTests.obj : error LNK2019: unresolved external symbol "public: class TestEndPoint::ExpectBase * __thiscall TestSipEndPoint::expect(struct std::pair<enum resip::MethodTypes,int>,class TestSipEndPoint::Matcher *,class TestEndPoint::ExpectPreCon &,int,class ActionBase *)" (?expect@TestSipEndPoint@@QAEPAVExpectBase@TestEndPoint@@U?$pair@W4MethodTypes@resip@@H@std@@PAVMatcher@1@AAVExpectPreCon@3@HPAVActionBase@@@Z) referenced in function "public: void __thiscall TestHolder::testInviteForkThreeCallerCancels(void)" (?testInviteForkThreeCallerCancels@TestHolder@@QAEXXZ)
1>sanityTests.obj : error LNK2019: unresolved external symbol "public: class CountDown::CountDownDec * __thiscall CountDown::dec(void)" (?dec@CountDown@@QAEPAVCountDownDec@1@XZ) referenced in function "public: void __thiscall TestHolder::testInviteForkThreeCallerCancels(void)" (?testInviteForkThreeCallerCancels@TestHolder@@QAEXXZ)
1>sanityTests.obj : error LNK2019: unresolved external symbol "public: __thiscall CountDown::CountDown(unsigned int,class resip::Data)" (??0CountDown@@QAE@IVData@resip@@@Z) referenced in function "public: void __thiscall TestHolder::testInviteForkThreeCallerCancels(void)" (?testInviteForkThreeCallerCancels@TestHolder@@QAEXXZ)
1>sanityTests.obj : error LNK2001: unresolved external symbol "public: static class TestUser * Fixture::jason3" (?jason3@Fixture@@2PAVTestUser@@A)
1>sanityTests.obj : error LNK2001: unresolved external symbol "public: virtual bool __thiscall CountDown::passes(class boost::shared_ptr<class Event>)" (?passes@CountDown@@UAE_NV?$shared_ptr@VEvent@@@boost@@@Z)
1>sanityTests.obj : error LNK2001: unresolved external symbol "public: virtual class resip::Data __thiscall CountDown::toString(void)const " (?toString@CountDown@@UBE?AVData@resip@@XZ)
1>sanityTests.obj : error LNK2019: unresolved external symbol "public: virtual __thiscall resip::Uri::~Uri(void)" (??1Uri@resip@@UAE@XZ) referenced in function "public: void __thiscall TestHolder::testInviteForkThenSpiral(void)" (?testInviteForkThenSpiral@TestHolder@@QAEXXZ)
1>sanityTests.obj : error LNK2019: unresolved external symbol "public: __thiscall resip::NameAddr::NameAddr(class resip::Uri const &)" (??0NameAddr@resip@@QAE@ABVUri@1@@Z) referenced in function "public: void __thiscall TestHolder::testInviteForkThenSpiral(void)" (?testInviteForkThenSpiral@TestHolder@@QAEXXZ)
1>sanityTests.obj : error LNK2019: unresolved external symbol "public: __thiscall resip::Uri::Uri(class resip::Data const &)" (??0Uri@resip@@QAE@ABVData@1@@Z) referenced in function "public: void __thiscall TestHolder::testInviteForkThenSpiral(void)" (?testInviteForkThenSpiral@TestHolder@@QAEXXZ)
1>sanityTests.obj : error LNK2019: unresolved external symbol "public: class TestSipEndPoint::MessageExpectAction * __thiscall TestSipEndPoint::send403(void)" (?send403@TestSipEndPoint@@QAEPAVMessageExpectAction@1@XZ) referenced in function "public: void __thiscall TestHolder::testInviteForkAll4xxResponses(void)" (?testInviteForkAll4xxResponses@TestHolder@@QAEXXZ)
1>sanityTests.obj : error LNK2019: unresolved external symbol "public: class TestSipEndPoint::MessageExpectAction * __thiscall TestSipEndPoint::send404(void)" (?send404@TestSipEndPoint@@QAEPAVMessageExpectAction@1@XZ) referenced in function "public: void __thiscall TestHolder::testInviteForkAll4xxResponses(void)" (?testInviteForkAll4xxResponses@TestHolder@@QAEXXZ)
1>sanityTests.obj : error LNK2019: unresolved external symbol "public: class TestSipEndPoint::MessageExpectAction * __thiscall TestSipEndPoint::send513(void)" (?send513@TestSipEndPoint@@QAEPAVMessageExpectAction@1@XZ) referenced in function "public: void __thiscall TestHolder::testInviteForkAll5xxResponses(void)" (?testInviteForkAll5xxResponses@TestHolder@@QAEXXZ)
1>sanityTests.obj : error LNK2019: unresolved external symbol "public: class TestSipEndPoint::MessageExpectAction * __thiscall TestSipEndPoint::send604(void)" (?send604@TestSipEndPoint@@QAEPAVMessageExpectAction@1@XZ) referenced in function "public: void __thiscall TestHolder::testInviteForkAll6xxResponses(void)" (?testInviteForkAll6xxResponses@TestHolder@@QAEXXZ)
1>sanityTests.obj : error LNK2019: unresolved external symbol "class SequenceClass * __cdecl Sub(class TestEndPoint::ExpectBase *,class TestEndPoint::ExpectBase *,class TestEndPoint::ExpectBase *,class TestEndPoint::ExpectBase *,class TestEndPoint::ExpectBase *,class TestEndPoint::ExpectBase *,class TestEndPoint::ExpectBase *,class TestEndPoint::ExpectBase *,class TestEndPoint::ExpectBase *,class TestEndPoint::ExpectBase *)" (?Sub@@YAPAVSequenceClass@@PAVExpectBase@TestEndPoint@@000000000@Z) referenced in function "public: void __thiscall TestHolder::testInviteSeqForkThenSpiral(void)" (?testInviteSeqForkThenSpiral@TestHolder@@QAEXXZ)
1>sanityTests.obj : error LNK2019: unresolved external symbol "public: __thiscall resip::NameAddr::NameAddr(class resip::Data const &)" (??0NameAddr@resip@@QAE@ABVData@1@@Z) referenced in function "public: void __thiscall TestHolder::testInviteSeqForkThenSpiral(void)" (?testInviteSeqForkThenSpiral@TestHolder@@QAEXXZ)
1>sanityTests.obj : error LNK2019: unresolved external symbol "public: class TestSipEndPoint::Request * __thiscall TestSipEndPoint::info(class TestSipEndPoint const *)" (?info@TestSipEndPoint@@QAEPAVRequest@1@PBV1@@Z) referenced in function "public: void __thiscall TestHolder::testInfo(void)" (?testInfo@TestHolder@@QAEXXZ)
1>sanityTests.obj : error LNK2019: unresolved external symbol "public: class TestSipEndPoint::Request * __thiscall TestSipEndPoint::message(class TestUser const &,class resip::Data const &)" (?message@TestSipEndPoint@@QAEPAVRequest@1@ABVTestUser@@ABVData@resip@@@Z) referenced in function "public: void __thiscall TestHolder::testNonInviteBusy(void)" (?testNonInviteBusy@TestHolder@@QAEXXZ)
1>sanityTests.obj : error LNK2019: unresolved external symbol "public: class TestSipEndPoint::Request * __thiscall TestSipEndPoint::message(class resip::Uri const &,class resip::Data const &)" (?message@TestSipEndPoint@@QAEPAVRequest@1@ABVUri@resip@@ABVData@4@@Z) referenced in function "public: void __thiscall TestHolder::testNonInviteSpiral(void)" (?testNonInviteSpiral@TestHolder@@QAEXXZ)
1>sanityTests.obj : error LNK2019: unresolved external symbol "public: class TestSipEndPoint::MessageExpectAction * __thiscall TestSipEndPoint::send400(void)" (?send400@TestSipEndPoint@@QAEPAVMessageExpectAction@1@XZ) referenced in function "public: void __thiscall TestHolder::testNonInvite4xxResponse(void)" (?testNonInvite4xxResponse@TestHolder@@QAEXXZ)
1>sanityTests.obj : error LNK2019: unresolved external symbol "public: class TestSipEndPoint::Subscribe * __thiscall TestSipEndPoint::subscribe(class TestUser const &,class resip::Token const &)" (?subscribe@TestSipEndPoint@@QAEPAVSubscribe@1@ABVTestUser@@ABVToken@resip@@@Z) referenced in function "public: void __thiscall TestHolder::testNonInviteWithAck200(void)" (?testNonInviteWithAck200@TestHolder@@QAEXXZ)
1>sanityTests.obj : error LNK2019: unresolved external symbol "public: __thiscall resip::Token::Token(class resip::Data const &)" (??0Token@resip@@QAE@ABVData@1@@Z) referenced in function "public: void __thiscall TestHolder::testNonInviteWithAck200(void)" (?testNonInviteWithAck200@TestHolder@@QAEXXZ)
1>sanityTests.obj : error LNK2019: unresolved external symbol "public: enum resip::MethodTypes & __thiscall resip::RequestLine::method(void)" (?method@RequestLine@resip@@QAEAAW4MethodTypes@2@XZ) referenced in function "public: static class boost::shared_ptr<class resip::SipMessage> __cdecl TestHolder::makeInvite(class boost::shared_ptr<class resip::SipMessage>)" (?makeInvite@TestHolder@@SA?AV?$shared_ptr@VSipMessage@resip@@@boost@@V23@@Z)
1>sanityTests.obj : error LNK2019: unresolved external symbol "public: class resip::RequestLine & __thiscall resip::SipMessage::header(class resip::RequestLineType const &)" (?header@SipMessage@resip@@QAEAAVRequestLine@2@ABVRequestLineType@2@@Z) referenced in function "public: static class boost::shared_ptr<class resip::SipMessage> __cdecl TestHolder::makeInvite(class boost::shared_ptr<class resip::SipMessage>)" (?makeInvite@TestHolder@@SA?AV?$shared_ptr@VSipMessage@resip@@@boost@@V23@@Z)
1>sanityTests.obj : error LNK2001: unresolved external symbol "class resip::RequestLineType resip::h_RequestLine" (?h_RequestLine@resip@@3VRequestLineType@1@A)
1>sanityTests.obj : error LNK2019: unresolved external symbol "class SequenceClass * __cdecl Sub(class TestEndPoint::ExpectBase *,class TestEndPoint::ExpectBase *,class TestEndPoint::ExpectBase *,class TestEndPoint::ExpectBase *,class TestEndPoint::ExpectBase *,class TestEndPoint::ExpectBase *,class TestEndPoint::ExpectBase *,class TestEndPoint::ExpectBase *,class TestEndPoint::ExpectBase *)" (?Sub@@YAPAVSequenceClass@@PAVExpectBase@TestEndPoint@@00000000@Z) referenced in function "public: void __thiscall TestHolder::testNonInviteClientRetransmissionsWithTimeout(void)" (?testNonInviteClientRetransmissionsWithTimeout@TestHolder@@QAEXXZ)
1>sanityTests.obj : error LNK2019: unresolved external symbol "public: class TestSipEndPoint::MessageExpectAction * __thiscall TestSipEndPoint::send302(void)" (?send302@TestSipEndPoint@@QAEPAVMessageExpectAction@1@XZ) referenced in function "public: void __thiscall TestHolder::testBasic302(void)" (?testBasic302@TestHolder@@QAEXXZ)
1>sanityTests.obj : error LNK2019: unresolved external symbol "public: class ExpectAction * __thiscall TestEndPoint::check1(class boost::function<bool __cdecl(class boost::shared_ptr<class Event>),class std::allocator<void> >,class resip::Data)" (?check1@TestEndPoint@@QAEPAVExpectAction@@V?$function@$$A6A_NV?$shared_ptr@VEvent@@@boost@@@ZV?$allocator@X@std@@@boost@@VData@resip@@@Z) referenced in function "public: void __thiscall TestHolder::testInviteForRport(void)" (?testInviteForRport@TestHolder@@QAEXXZ)
1>sanityTests.obj : error LNK2019: unresolved external symbol "public: int __thiscall TestSipEndPoint::getPort(void)const " (?getPort@TestSipEndPoint@@QBEHXZ) referenced in function "public: void __thiscall TestHolder::testInviteForRport(void)" (?testInviteForRport@TestHolder@@QAEXXZ)
1>sanityTests.obj : error LNK2019: unresolved external symbol "public: class resip::RportParameter & __thiscall resip::ParserCategory::param(class resip::rport_Param const &)" (?param@ParserCategory@resip@@QAEAAVRportParameter@2@ABVrport_Param@2@@Z) referenced in function "public: static class boost::shared_ptr<class resip::SipMessage> & __cdecl TestHolder::addRport(class boost::shared_ptr<class resip::SipMessage> &)" (?addRport@TestHolder@@SAAAV?$shared_ptr@VSipMessage@resip@@@boost@@AAV23@@Z)
1>sanityTests.obj : error LNK2001: unresolved external symbol "class resip::rport_Param resip::p_rport" (?p_rport@resip@@3Vrport_Param@1@A)
1>sanityTests.obj : error LNK2019: unresolved external symbol "public: bool __thiscall resip::ParserContainerBase::empty(void)const " (?empty@ParserContainerBase@resip@@QBE_NXZ) referenced in function "public: static class boost::shared_ptr<class resip::SipMessage> & __cdecl TestHolder::addRport(class boost::shared_ptr<class resip::SipMessage> &)" (?addRport@TestHolder@@SAAAV?$shared_ptr@VSipMessage@resip@@@boost@@AAV23@@Z)
1>sanityTests.obj : error LNK2019: unresolved external symbol "public: class TestSipEndPoint::Refer * __thiscall TestSipEndPoint::referReplaces(class resip::Uri const &,class resip::Uri const &)" (?referReplaces@TestSipEndPoint@@QAEPAVRefer@1@ABVUri@resip@@0@Z) referenced in function "public: void __thiscall TestHolder::testAttendedExtensionToExtensionTransfer(void)" (?testAttendedExtensionToExtensionTransfer@TestHolder@@QAEXXZ)
1>sanityTests.obj : error LNK2019: unresolved external symbol "public: class resip::Uri const & __thiscall resip::NameAddr::uri(void)const " (?uri@NameAddr@resip@@QBEABVUri@2@XZ) referenced in function "public: void __thiscall TestHolder::testAttendedExtensionToExtensionTransfer(void)" (?testAttendedExtensionToExtensionTransfer@TestHolder@@QAEXXZ)
1>sanityTests.obj : error LNK2019: unresolved external symbol "public: class resip::NameAddr const & __thiscall TestSipEndPoint::getContact(void)const " (?getContact@TestSipEndPoint@@QBEABVNameAddr@resip@@XZ) referenced in function "public: void __thiscall TestHolder::testAttendedExtensionToExtensionTransfer(void)" (?testAttendedExtensionToExtensionTransfer@TestHolder@@QAEXXZ)
1>sanityTests.obj : error LNK2019: unresolved external symbol "public: class resip::Uri const & __thiscall TestSipEndPoint::getAddressOfRecord(void)const " (?getAddressOfRecord@TestSipEndPoint@@QBEABVUri@resip@@XZ) referenced in function "public: void __thiscall TestHolder::testAttendedExtensionToExtensionTransfer(void)" (?testAttendedExtensionToExtensionTransfer@TestHolder@@QAEXXZ)
1>sanityTests.obj : error LNK2019: unresolved external symbol "public: class TestSipEndPoint::MessageExpectAction * __thiscall TestSipEndPoint::send202(void)" (?send202@TestSipEndPoint@@QAEPAVMessageExpectAction@1@XZ) referenced in function "public: void __thiscall TestHolder::testAttendedExtensionToExtensionTransfer(void)" (?testAttendedExtensionToExtensionTransfer@TestHolder@@QAEXXZ)
1>sanityTests.obj : error LNK2019: unresolved external symbol "public: class TestSipEndPoint::InviteReferReplaces * __thiscall TestSipEndPoint::inviteReferReplaces(void)" (?inviteReferReplaces@TestSipEndPoint@@QAEPAVInviteReferReplaces@1@XZ) referenced in function "public: void __thiscall TestHolder::testAttendedExtensionToExtensionTransfer(void)" (?testAttendedExtensionToExtensionTransfer@TestHolder@@QAEXXZ)
1>sanityTests.obj : error LNK2019: unresolved external symbol "public: class ExpectAction * __thiscall TestSipEndPoint::notify200(class TestSipEndPoint const &)" (?notify200@TestSipEndPoint@@QAEPAVExpectAction@@ABV1@@Z) referenced in function "public: void __thiscall TestHolder::testAttendedExtensionToExtensionTransfer(void)" (?testAttendedExtensionToExtensionTransfer@TestHolder@@QAEXXZ)
1>sanityTests.obj : error LNK2019: unresolved external symbol "public: class TestSipEndPoint::ReInvite * __thiscall TestSipEndPoint::reInvite(class TestSipEndPoint const &)" (?reInvite@TestSipEndPoint@@QAEPAVReInvite@1@ABV1@@Z) referenced in function "public: void __thiscall TestHolder::testAttendedExtensionToExtensionTransfer(void)" (?testAttendedExtensionToExtensionTransfer@TestHolder@@QAEXXZ)
1>sanityTests.obj : error LNK2019: unresolved external symbol "public: class TestSipEndPoint::Refer * __thiscall TestSipEndPoint::refer(class resip::Uri const &,class resip::Uri const &)" (?refer@TestSipEndPoint@@QAEPAVRefer@1@ABVUri@resip@@0@Z) referenced in function "public: void __thiscall TestHolder::testBlindTransferExtensionToExtensionHangupImmediately(void)" (?testBlindTransferExtensionToExtensionHangupImmediately@TestHolder@@QAEXXZ)
1>sanityTests.obj : error LNK2019: unresolved external symbol "public: class TestSipEndPoint::InviteReferReplaces * __thiscall TestSipEndPoint::inviteReferredBy(void)" (?inviteReferredBy@TestSipEndPoint@@QAEPAVInviteReferReplaces@1@XZ) referenced in function "public: void __thiscall TestHolder::testBlindTransferExtensionToExtensionHangupImmediately(void)" (?testBlindTransferExtensionToExtensionHangupImmediately@TestHolder@@QAEXXZ)
1>sanityTests.obj : error LNK2019: unresolved external symbol "public: class TestSipEndPoint::MessageExpectAction * __thiscall TestSipEndPoint::ring183(void)" (?ring183@TestSipEndPoint@@QAEPAVMessageExpectAction@1@XZ) referenced in function "public: void __thiscall TestHolder::testEarlyMedia(void)" (?testEarlyMedia@TestHolder@@QAEXXZ)
1>sanityTests.obj : error LNK2019: unresolved external symbol "public: class ExpectAction * __thiscall TestSipEndPoint::bye(class TestSipEndPoint const &)" (?bye@TestSipEndPoint@@QAEPAVExpectAction@@ABV1@@Z) referenced in function "public: void __thiscall TestHolder::testEarlyMedia(void)" (?testEarlyMedia@TestHolder@@QAEXXZ)
1>sanityTests.obj : error LNK2019: unresolved external symbol "class TestSipEndPoint::MessageExpectAction * __cdecl rawcondition(class boost::function<class resip::Data __cdecl(class resip::Data const &),class std::allocator<void> >,class TestSipEndPoint::MessageExpectAction *)" (?rawcondition@@YAPAVMessageExpectAction@TestSipEndPoint@@V?$function@$$A6A?AVData@resip@@ABV12@@ZV?$allocator@X@std@@@boost@@PAV12@@Z) referenced in function "public: void __thiscall TestHolder::testTCPMultiMsg(void)" (?testTCPMultiMsg@TestHolder@@QAEXXZ)
1>sanityTests.obj : error LNK2001: unresolved external symbol "public: static class TestUser * Fixture::jozsef" (?jozsef@Fixture@@2PAVTestUser@@A)
1>sanityTests.obj : error LNK2019: unresolved external symbol "public: class TestSipEndPoint::RawSend * __thiscall TestSipEndPoint::rawSend(class resip::Uri const &,class resip::Data const &)" (?rawSend@TestSipEndPoint@@QAEPAVRawSend@1@ABVUri@resip@@ABVData@4@@Z) referenced in function "public: void __thiscall TestHolder::testTCPPreparseError(void)" (?testTCPPreparseError@TestHolder@@QAEXXZ)
1>sanityTests.obj : error LNK2019: unresolved external symbol "public: class resip::Data __thiscall resip::Data::base64decode(void)const " (?base64decode@Data@resip@@QBE?AV12@XZ) referenced in function "public: void __thiscall TestHolder::testTCPPreparseError(void)" (?testTCPPreparseError@TestHolder@@QAEXXZ)
1>sanityTests.obj : error LNK2019: unresolved external symbol "public: __thiscall resip::Uri::Uri(void)" (??0Uri@resip@@QAE@XZ) referenced in function "public: void __thiscall TestHolder::testTCPPreparseError(void)" (?testTCPPreparseError@TestHolder@@QAEXXZ)
1>sanityTests.obj : error LNK2019: unresolved external symbol "public: static void __cdecl resip::Random::initialize(void)" (?initialize@Random@resip@@SAXXZ) referenced in function "public: void __thiscall TestHolder::testTCPPreparseError(void)" (?testTCPPreparseError@TestHolder@@QAEXXZ)
1>sanityTests.obj : error LNK2019: unresolved external symbol "public: virtual __thiscall resip::ParserCategory::~ParserCategory(void)" (??1ParserCategory@resip@@UAE@XZ) referenced in function "public: virtual __thiscall resip::Token::~Token(void)" (??1Token@resip@@UAE@XZ)
1>sanityTests.obj : error LNK2019: unresolved external symbol "public: virtual __thiscall CppUnit::TestCase::~TestCase(void)" (??1TestCase@CppUnit@@UAE@XZ) referenced in function __unwindfunclet$??0?$TestCaller@VTestHolder@@@CppUnit@@QAE@V?$basic_string@DU?$char_traits@D@std@@V?$allocator@D@2@@std@@P8TestHolder@@AEXXZ@Z$0
1>sanityTests.obj : error LNK2019: unresolved external symbol "public: __thiscall CppUnit::TestCase::TestCase(class std::basic_string<char,struct std::char_traits<char>,class std::allocator<char> > const &)" (??0TestCase@CppUnit@@QAE@ABV?$basic_string@DU?$char_traits@D@std@@V?$allocator@D@2@@std@@@Z) referenced in function "public: __thiscall CppUnit::TestCaller<class TestHolder>::TestCaller<class TestHolder>(class std::basic_string<char,struct std::char_traits<char>,class std::allocator<char> >,void (__thiscall TestHolder::*)(void))" (??0?$TestCaller@VTestHolder@@@CppUnit@@QAE@V?$basic_string@DU?$char_traits@D@std@@V?$allocator@D@2@@std@@P8TestHolder@@AEXXZ@Z)
1>sanityTests.obj : error LNK2001: unresolved external symbol "public: virtual void __thiscall CppUnit::TestCase::run(class CppUnit::TestResult *)" (?run@TestCase@CppUnit@@UAEXPAVTestResult@2@@Z)
1>sanityTests.obj : error LNK2001: unresolved external symbol "public: virtual int __thiscall CppUnit::TestLeaf::countTestCases(void)const " (?countTestCases@TestLeaf@CppUnit@@UBEHXZ)
1>sanityTests.obj : error LNK2001: unresolved external symbol "public: virtual int __thiscall CppUnit::TestLeaf::getChildTestCount(void)const " (?getChildTestCount@TestLeaf@CppUnit@@UBEHXZ)
1>sanityTests.obj : error LNK2001: unresolved external symbol "public: virtual class CppUnit::Test * __thiscall CppUnit::Test::getChildTestAt(int)const " (?getChildTestAt@Test@CppUnit@@UBEPAV12@H@Z)
1>sanityTests.obj : error LNK2001: unresolved external symbol "public: virtual class std::basic_string<char,struct std::char_traits<char>,class std::allocator<char> > __thiscall CppUnit::TestCase::getName(void)const " (?getName@TestCase@CppUnit@@UBE?AV?$basic_string@DU?$char_traits@D@std@@V?$allocator@D@2@@std@@XZ)
1>sanityTests.obj : error LNK2001: unresolved external symbol "public: virtual bool __thiscall CppUnit::Test::findTestPath(class CppUnit::Test const *,class CppUnit::TestPath &)const " (?findTestPath@Test@CppUnit@@UBE_NPBV12@AAVTestPath@2@@Z)
1>sanityTests.obj : error LNK2001: unresolved external symbol "public: virtual bool __thiscall CppUnit::Test::findTestPath(class std::basic_string<char,struct std::char_traits<char>,class std::allocator<char> > const &,class CppUnit::TestPath &)const " (?findTestPath@Test@CppUnit@@UBE_NABV?$basic_string@DU?$char_traits@D@std@@V?$allocator@D@2@@std@@AAVTestPath@2@@Z)
1>sanityTests.obj : error LNK2001: unresolved external symbol "public: virtual class CppUnit::Test * __thiscall CppUnit::Test::findTest(class std::basic_string<char,struct std::char_traits<char>,class std::allocator<char> > const &)const " (?findTest@Test@CppUnit@@UBEPAV12@ABV?$basic_string@DU?$char_traits@D@std@@V?$allocator@D@2@@std@@@Z)
1>sanityTests.obj : error LNK2001: unresolved external symbol "public: virtual class CppUnit::TestPath __thiscall CppUnit::Test::resolveTestPath(class std::basic_string<char,struct std::char_traits<char>,class std::allocator<char> > const &)const " (?resolveTestPath@Test@CppUnit@@UBE?AVTestPath@2@ABV?$basic_string@DU?$char_traits@D@std@@V?$allocator@D@2@@std@@@Z)
1>sanityTests.obj : error LNK2001: unresolved external symbol "protected: virtual void __thiscall CppUnit::Test::checkIsValidIndex(int)const " (?checkIsValidIndex@Test@CppUnit@@MBEXH@Z)
1>sanityTests.obj : error LNK2001: unresolved external symbol "public: virtual class CppUnit::Test * __thiscall CppUnit::TestLeaf::doGetChildTestAt(int)const " (?doGetChildTestAt@TestLeaf@CppUnit@@UBEPAVTest@2@H@Z)
1>sanityTests.obj : error LNK2019: unresolved external symbol "public: __thiscall Fixture::Fixture(void)" (??0Fixture@@QAE@XZ) referenced in function "public: __thiscall TestHolder::TestHolder(void)" (??0TestHolder@@QAE@XZ)
1>sanityTests.obj : error LNK2001: unresolved external symbol "public: virtual void __thiscall Fixture::setUp(void)" (?setUp@Fixture@@UAEXXZ)
1>sanityTests.obj : error LNK2001: unresolved external symbol "public: virtual void __thiscall Fixture::tearDown(void)" (?tearDown@Fixture@@UAEXXZ)
1>sanityTests.obj : error LNK2019: unresolved external symbol "public: virtual __thiscall Fixture::~Fixture(void)" (??1Fixture@@UAE@XZ) referenced in function "public: virtual __thiscall TestHolder::~TestHolder(void)" (??1TestHolder@@UAE@XZ)
1>sanityTests.obj : error LNK2019: unresolved external symbol "public: bool __thiscall resip::NameAddr::operator<(class resip::NameAddr const &)const " (??MNameAddr@resip@@QBE_NABV01@@Z) referenced in function "public: bool __thiscall std::less<class resip::NameAddr>::operator()(class resip::NameAddr const &,class resip::NameAddr const &)const " (??R?$less@VNameAddr@resip@@@std@@QBE_NABVNameAddr@resip@@0@Z)
1>sanityTests.obj : error LNK2019: unresolved external symbol "public: bool __thiscall resip::ParserCategory::exists(class resip::ParamBase const &)const " (?exists@ParserCategory@resip@@QBE_NABVParamBase@2@@Z) referenced in function "public: bool __thiscall TestHolder::CheckRport::operator()(class boost::shared_ptr<class Event>)const " (??RCheckRport@TestHolder@@QBE_NV?$shared_ptr@VEvent@@@boost@@@Z)
1>sanityTests.obj : error LNK2019: unresolved external symbol "class std::basic_ostream<char,struct std::char_traits<char> > & __cdecl resip::operator<<(class std::basic_ostream<char,struct std::char_traits<char> > &,class resip::Message const &)" (??6resip@@YAAAV?$basic_ostream@DU?$char_traits@D@std@@@std@@AAV12@ABVMessage@0@@Z) referenced in function "public: bool __thiscall TestHolder::CheckRport::operator()(class boost::shared_ptr<class Event>)const " (??RCheckRport@TestHolder@@QBE_NV?$shared_ptr@VEvent@@@boost@@@Z)
1>sanityTests.obj : error LNK2019: unresolved external symbol "public: class boost::shared_ptr<class resip::SipMessage> __thiscall SipEvent::getMessage(void)" (?getMessage@SipEvent@@QAE?AV?$shared_ptr@VSipMessage@resip@@@boost@@XZ) referenced in function "public: bool __thiscall TestHolder::CheckRport::operator()(class boost::shared_ptr<class Event>)const " (??RCheckRport@TestHolder@@QBE_NV?$shared_ptr@VEvent@@@boost@@@Z)
1>sanityTests.obj : error LNK2019: unresolved external symbol "public: static bool __cdecl resip::Data::init(struct resip::DataLocalSize<16>)" (?init@Data@resip@@SA_NU?$DataLocalSize@$0BA@@2@@Z) referenced in function "void __cdecl resip::`dynamic initializer for 'invokeDataInit''(void)" (??__EinvokeDataInit@resip@@YAXXZ)
1>sanityTests.obj : error LNK2019: unresolved external symbol "public: static bool __cdecl resip::Log::init(void)" (?init@Log@resip@@SA_NXZ) referenced in function "void __cdecl resip::`dynamic initializer for 'invokeLogInit''(void)" (??__EinvokeLogInit@resip@@YAXXZ)
1>sanityTests.obj : error LNK2019: unresolved external symbol "public: static bool __cdecl resip::SdpContents::init(void)" (?init@SdpContents@resip@@SA_NXZ) referenced in function "void __cdecl resip::`dynamic initializer for 'invokeSdpContentsInit''(void)" (??__EinvokeSdpContentsInit@resip@@YAXXZ)
1>Debug/sanityTests.exe : fatal error LNK1120: 216 unresolved externals

Open in new window

0
evilrixSenior Software Engineer (Avast)Commented:
You also need to ensure you have the correct library for your specific compiler (not just brand but also version) since all compilers/linkers implement C++ name decorating (name mangling) differently. Code built, for example, with VC2003 may not link with code built with VS2005.

http://en.wikipedia.org/wiki/Name_mangling
0
evilrixSenior Software Engineer (Avast)Commented:
More on name decorating...
http://support.microsoft.com/kb/126845
0
evilrixSenior Software Engineer (Avast)Commented:
Note: You might, if it's possible, be better off building this library yourself. That way you'd have no dependency on any specific compiler or compiler version.
0
http:// thevpn.guruAuthor Commented:
Infinity no I dont have a .. dir..actually the compiler is finding the file..however renaming resulted in the probs above ...changing the include path would result in the same I guess ??

Any more suggestions ?

Thx
0
evilrixSenior Software Engineer (Avast)Commented:
>> Any more suggestions ?
See above. The fact you no longer get the error about not finding the library suggests the issue now is the library itself is not suitable. I've given possible reasons for that above.
0
http:// thevpn.guruAuthor Commented:
@evilrix thanks for your help, I am a newbie in this..and this is a one time stop at VC8 I only need to compile this project no more, and I am really not getting any smarter out of the naming conventions etc.

The solution has 8 projects that all link fine except this last one it compiles fine but it does not link correctly.  

Should I be searching for a diff openssl version now ?

Thx
0
evilrixSenior Software Engineer (Avast)Commented:
>> Should I be searching for a diff openssl version now ?

Just make sure the library you have is specified to work with VC8, if not see if you can find a version that is. Unfortunately linking issues are a right royal pain to solve since it's not usually obvious what the problem is. What I've suggested above is the most obvious but not necessarily the actual reason. Rule this out first and then we can look at what's left.

-Rx.
0
http:// thevpn.guruAuthor Commented:
Well the thing is the openssl libraries can only be fetched from the openssl site..so if their version does not work...which would work ?
0
evilrixSenior Software Engineer (Avast)Commented:
>> which would work ?
Build it yourself :)

Post the link here and I'll look at the site for you.
0
evilrixSenior Software Engineer (Avast)Commented:
Actually, looking at your error again, it's CPPUNIT functions that can't be found. Have you included this library?

Thinking aboit it, I'd be surprised if opensll libraries weren't provided with an extern C interface (avoiding name decoration issues).
0
http:// thevpn.guruAuthor Commented:
You are right thanks
I added it but I am getting the following while compiling it

1>Generating Code...
1>Creating library...
1>Copying target to lib/
1>The system cannot find the path specified.
1>        0 file(s) copied.
1>Project : error PRJ0019: A tool returned an error code from "Copying target to lib/"

where exactly should lib/ exist ?

thx
0
evilrixSenior Software Engineer (Avast)Commented:
>> I added it but I am getting the following while compiling it
That looks like an error in your project settings. It looks like it is trying to write the library to an invalid output path. Check you project settings for the linkers output.

>> where exactly should lib/ exist ?
For me the output from the linker is $(OutDir)\$(ProjectName).lib for a library and $(OutDir)\$(ProjectName).exe for an executable
0

Experts Exchange Solution brought to you by

Your issues matter to us.

Facing a tech roadblock? Get the help and guidance you need from experienced professionals who care. Ask your question anytime, anywhere, with no hassle.

Start your 7-day free trial
It's more than this solution.Get answers and train to solve all your tech problems - anytime, anywhere.Try it for free Edge Out The Competitionfor your dream job with proven skills and certifications.Get started today Stand Outas the employee with proven skills.Start learning today for free Move Your Career Forwardwith certification training in the latest technologies.Start your trial today
Editors IDEs

From novice to tech pro — start learning today.