• Status: Solved
  • Priority: Medium
  • Security: Public
  • Views: 975
  • Last Modified:

Clamav-0.97

I am getting this error when I upgrade clamav-0.97 from clamav-0.96.5 right after type "make check"

SKIP: check_clamav
PASS: check_freshclam.sh
PASS: check_sigtool.sh
SKIP: check_unit_vg.sh
PASS: check1_clamscan.sh
FAIL: check2_clamd.sh
PASS: check3_clamd.sh
PASS: check4_clamd.sh
SKIP: check5_clamd_vg.sh
SKIP: check6_clamd_vg.sh
SKIP: check7_clamd_hg.sh
SKIP: check8_clamd_hg.sh
SKIP: check9_clamscan_vg.sh
========================================
1 of 6 tests failed
(7 tests were not run)
See unit_tests/test-suite.log
Please report to http://bugs.clamav.net/
========================================
make[3]: *** [test-suite.log] Error 1
make[3]: Leaving directory `/opt/installs/clam/0.97/clamav-0.97/unit_tests'
make[2]: *** [check-TESTS] Error 2
make[2]: Leaving directory `/opt/installs/clam/0.97/clamav-0.97/unit_tests'
make[1]: *** [check-am] Error 2
make[1]: Leaving directory `/opt/installs/clam/0.97/clamav-0.97/unit_tests'
make: *** [check-recursive] Error 1

I have never had this problem before and I am newbie about Linux. This is running Fedora 14 64 bit.
Thanks in advance
0
Ksean
Asked:
Ksean
1 Solution
 
t-maxCommented:
Perhaps you can check that script yourself (check2_clamd.sh) to see why it's failing. I guess it's located in /opt/installs/clam/0.97/clamav-0.97/unit_tests
You can get more details in the log file unit_tests/test-suite.log
If you need more help, perhaps post some relevant info from these files.
0
 
KseanAuthor Commented:
this gives me some idea to troubleshoot.
0

Featured Post

Free Tool: Path Explorer

An intuitive utility to help find the CSS path to UI elements on a webpage. These paths are used frequently in a variety of front-end development and QA automation tasks.

One of a set of tools we're offering as a way of saying thank you for being a part of the community.

Tackle projects and never again get stuck behind a technical roadblock.
Join Now