Want to win a PS4? Go Premium and enter to win our High-Tech Treats giveaway. Enter to Win

x
?
Solved

database - build all fails

Posted on 2013-01-14
1
Medium Priority
?
953 Views
Last Modified: 2013-01-15
Trying to build a project and it says "rebuild failed"

No error message is displayed in the error list.  It says "0 Errors".

How can I find out the reason it is failing?


UPDATE:

I did find this in the Output Window:

------ Rebuild All started: Project: Models, Configuration: Debug Any CPU ------
  Models -> C:\R13\Models\bin\Debug\Models.dll
------ Rebuild All started: Project: GoogleMaps, Configuration: Debug Any CPU ------
  GoogleMaps -> C:\R13\GOOGLEMAPS\bin\Debug\GoogleMaps.dll
------ Rebuild All started: Project: ReoCougarDB, Configuration: Debug Any CPU ------
  ReoCougarDB -> C:\R13\ReoCougarDB\bin\Debug\ReoCougarDB.dll
------ Rebuild All started: Project: Database, Configuration: Debug Any CPU ------
    Loading project files...
    Building the project model and resolving object interdependencies...
    Validating the project model...
    Writing model to Database.dbschema...
C:\Program Files\MSBuild\Microsoft\VisualStudio\v10.0\TeamData\Microsoft.Data.Schema.TSqlTasks.targets(102,7): Error MSB4094: "Scripts\Post-Deployment\Script.PostDeployment.sql;Scripts\Post-Deployment\Script.PostDeployment.sql" is an invalid value for the "PostdeployItem" parameter of the "SqlSetupDeployTask" task. Multiple items cannot be passed into a parameter of type "Microsoft.Build.Framework.ITaskItem".
   Done executing task "SqlSetupDeployTask" -- FAILED.
  Done building target "DspSetupDeploy" in project "Database.dbproj" -- FAILED.
 Done executing task "CallTarget" -- FAILED.
Done building target "DBSetupDeploy" in project "Database.dbproj" -- FAILED.
Done building project "Database.dbproj" -- FAILED.

Build FAILED.

Open in new window




Many posts found online keep talking about an IDL file?

What are IDL files?
0
Comment
Question by:Tom Knowlton
[X]
Welcome to Experts Exchange

Add your voice to the tech community where 5M+ people just like you are talking about what matters.

  • Help others & share knowledge
  • Earn cash & points
  • Learn & ask questions
1 Comment
 
LVL 21

Accepted Solution

by:
masterpass earned 2000 total points
ID: 38776841
You are having invalid values in the project properties. Right click the project and click on properties. Go through the build events and see if it makes sense to you.
0

Featured Post

Independent Software Vendors: We Want Your Opinion

We value your feedback.

Take our survey and automatically be enter to win anyone of the following:
Yeti Cooler, Amazon eGift Card, and Movie eGift Card!

Question has a verified solution.

If you are experiencing a similar issue, please ask a related question

This article discusses the ASP.NET AJAX ModalPopupExtender control. In this article we will show how to use the ModalPopupExtender control, how to display/show/call the ASP.NET AJAX ModalPopupExtender control from javascript, how to show/display/cal…
It was really hard time for me to get the understanding of Delegates in C#. I went through many websites and articles but I found them very clumsy. After going through those sites, I noted down the points in a easy way so here I am sharing that unde…
Video by: ITPro.TV
In this episode Don builds upon the troubleshooting techniques by demonstrating how to properly monitor a vSphere deployment to detect problems before they occur. He begins the show using tools found within the vSphere suite as ends the show demonst…
This tutorial will teach you the special effect of super speed similar to the fictional character Wally West aka "The Flash" After Shake : http://www.videocopilot.net/presets/after_shake/ All lightning effects with instructions : http://www.mediaf…

604 members asked questions and received personalized solutions in the past 7 days.

Join the community of 500,000 technology professionals and ask your questions.

Join & Ask a Question