Solved

problem installing NET::SSLeay from CPAN

Posted on 2013-06-05
4
3,156 Views
Last Modified: 2013-06-05
Any ideas?

I did notice it says

*** Be sure to use the same compiler and options to compile your OpenSSL, perl,
    and Net::SSLeay. Mixing and matching compilers is not supported.

Open in new window


But not sure how to check what perl or openssl was compiled with.

FYI This is a RHEL 6.4 laptop.  I ran yum install gcc just now as the last error I got was that NET::SSLeay needed the C compiler.


Below is full output.

[root ~]# cpan Net::SSLeay
CPAN: Storable loaded ok (v2.20)
Going to read '/root/.cpan/Metadata'
  Database was generated on Wed, 05 Jun 2013 15:53:02 GMT
Running install for module 'Net::SSLeay'
CPAN: Data::Dumper loaded ok (v2.124)
'YAML' not installed, falling back to Data::Dumper and Storable to read prefs '/root/.cpan/prefs'
Running make for M/MI/MIKEM/Net-SSLeay-1.54.tar.gz
CPAN: Digest::SHA loaded ok (v5.47)
CPAN: Compress::Zlib loaded ok (v2.061)
Checksum for /root/.cpan/sources/authors/id/M/MI/MIKEM/Net-SSLeay-1.54.tar.gz ok
Net-SSLeay-1.54/
Net-SSLeay-1.54/ppport.h
Net-SSLeay-1.54/typemap
Net-SSLeay-1.54/README
Net-SSLeay-1.54/Changes
Net-SSLeay-1.54/QuickRef
Net-SSLeay-1.54/lib/
Net-SSLeay-1.54/lib/Net/
Net-SSLeay-1.54/lib/Net/SSLeay/
Net-SSLeay-1.54/lib/Net/SSLeay/Handle.pm
Net-SSLeay-1.54/lib/Net/SSLeay.pm
Net-SSLeay-1.54/lib/Net/SSLeay.pod
Net-SSLeay-1.54/Credits
Net-SSLeay-1.54/helper_script/
Net-SSLeay-1.54/helper_script/regen_openssl_constants.pl
Net-SSLeay-1.54/inc/
Net-SSLeay-1.54/inc/Module/
Net-SSLeay-1.54/inc/Module/Install.pm
Net-SSLeay-1.54/inc/Module/Install/
Net-SSLeay-1.54/inc/Module/Install/Base.pm
Net-SSLeay-1.54/inc/Module/Install/PRIVATE/
Net-SSLeay-1.54/inc/Module/Install/PRIVATE/Net/
Net-SSLeay-1.54/inc/Module/Install/PRIVATE/Net/SSLeay.pm
Net-SSLeay-1.54/inc/Module/Install/Metadata.pm
Net-SSLeay-1.54/inc/Module/Install/WriteAll.pm
Net-SSLeay-1.54/inc/Module/Install/Makefile.pm
Net-SSLeay-1.54/inc/Module/Install/Win32.pm
Net-SSLeay-1.54/inc/Module/Install/Fetch.pm
Net-SSLeay-1.54/inc/Module/Install/External.pm
Net-SSLeay-1.54/inc/Module/Install/Can.pm
Net-SSLeay-1.54/META.yml
Net-SSLeay-1.54/README.Win32
Net-SSLeay-1.54/t/
Net-SSLeay-1.54/t/local/
Net-SSLeay-1.54/t/local/34_x509_crl.t
Net-SSLeay-1.54/t/local/06_tcpecho.t
Net-SSLeay-1.54/t/local/02_pod_coverage.t
Net-SSLeay-1.54/t/local/39_pkcs12.t
Net-SSLeay-1.54/t/local/03_use.t
Net-SSLeay-1.54/t/local/30_error.t
Net-SSLeay-1.54/t/local/32_x509_get_cert_info.t
Net-SSLeay-1.54/t/local/05_passwd_cb.t
Net-SSLeay-1.54/t/local/37_asn1_time.t
Net-SSLeay-1.54/t/local/07_sslecho.t
Net-SSLeay-1.54/t/local/61_threads-cb-crash.t
Net-SSLeay-1.54/t/local/04_basic.t
Net-SSLeay-1.54/t/local/kwalitee.t
Net-SSLeay-1.54/t/local/31_rsa_generate_key.t
Net-SSLeay-1.54/t/local/20_autoload.t
Net-SSLeay-1.54/t/local/36_verify.t
Net-SSLeay-1.54/t/local/21_constants.t
Net-SSLeay-1.54/t/local/15_bio.t
Net-SSLeay-1.54/t/local/40_npn_support.t
Net-SSLeay-1.54/t/local/50_digest.t
Net-SSLeay-1.54/t/local/38_priv-key.t
Net-SSLeay-1.54/t/local/35_ephemeral.t
Net-SSLeay-1.54/t/local/01_pod.t
Net-SSLeay-1.54/t/local/08_pipe.t
Net-SSLeay-1.54/t/local/62_threads-ctx_new-deadlock.t
Net-SSLeay-1.54/t/local/33_x509_create_cert.t
Net-SSLeay-1.54/t/external/
Net-SSLeay-1.54/t/external/08_external.t
Net-SSLeay-1.54/t/external/15_altnames.t
Net-SSLeay-1.54/t/handle/
Net-SSLeay-1.54/t/handle/local/
Net-SSLeay-1.54/t/handle/local/05_use.t
Net-SSLeay-1.54/t/handle/external/
Net-SSLeay-1.54/t/handle/external/10_destroy.t
Net-SSLeay-1.54/t/handle/external/50_external.t
Net-SSLeay-1.54/t/data/
Net-SSLeay-1.54/t/data/key.pem.e
Net-SSLeay-1.54/t/data/verisign.crl.pem
Net-SSLeay-1.54/t/data/cert_paypal.crt.pem
Net-SSLeay-1.54/t/data/cert_paypal.crt.pem_dump
Net-SSLeay-1.54/t/data/pkcs12-no-passwd.p12
Net-SSLeay-1.54/t/data/testcert_extended.crt.pem
Net-SSLeay-1.54/t/data/testcert_simple.crt.pem
Net-SSLeay-1.54/t/data/testcert_strange.crt.pem_dump
Net-SSLeay-1.54/t/data/test_CA1.key.der
Net-SSLeay-1.54/t/data/testcert_cdp.crt.pem_dump
Net-SSLeay-1.54/t/data/test_CA1.encrypted_key.pem
Net-SSLeay-1.54/t/data/testcert_cdp.crt.pem
Net-SSLeay-1.54/t/data/test_CA1.crt.der
Net-SSLeay-1.54/t/data/test_CA1.crl.der
Net-SSLeay-1.54/t/data/testreq1.der
Net-SSLeay-1.54/t/data/testcert_simple.crt.der
Net-SSLeay-1.54/t/data/pkcs12-full.p12
Net-SSLeay-1.54/t/data/cert_twitter.crt.pem_dump
Net-SSLeay-1.54/t/data/binary-test.file
Net-SSLeay-1.54/t/data/test_CA1.crt.pem
Net-SSLeay-1.54/t/data/testcert_simple.crt.pem_dump
Net-SSLeay-1.54/t/data/testcert_extended.crt.pem_dump
Net-SSLeay-1.54/t/data/key.pem
Net-SSLeay-1.54/t/data/testcert_strange.crt.pem
Net-SSLeay-1.54/t/data/pkcs12-no-chain.p12
Net-SSLeay-1.54/t/data/cert_twitter.crt.pem
Net-SSLeay-1.54/t/data/test_CA1.key.pem
Net-SSLeay-1.54/t/data/cert.pem
Net-SSLeay-1.54/t/data/verisign.crl.der
Net-SSLeay-1.54/t/data/testreq1.pem
Net-SSLeay-1.54/Debian_CPANTS.txt
Net-SSLeay-1.54/MANIFEST
Net-SSLeay-1.54/constants.c
Net-SSLeay-1.54/SSLeay.xs
Net-SSLeay-1.54/README.VMS
Net-SSLeay-1.54/Makefile.PL
Net-SSLeay-1.54/examples/
Net-SSLeay-1.54/examples/https-proxy-snif.pl
Net-SSLeay-1.54/examples/cb-testi.pl
Net-SSLeay-1.54/examples/server_key.pem
Net-SSLeay-1.54/examples/ephemeral.pl
Net-SSLeay-1.54/examples/passwd-cb.pl
Net-SSLeay-1.54/examples/tcpcat.pl
Net-SSLeay-1.54/examples/sslcat.pl
Net-SSLeay-1.54/examples/bio.pl
Net-SSLeay-1.54/examples/cli-cert.pl
Net-SSLeay-1.54/examples/ssl-inetd-serv.pl
Net-SSLeay-1.54/examples/callback.pl
Net-SSLeay-1.54/examples/get_page_cert.pl
Net-SSLeay-1.54/examples/get_page.pl
Net-SSLeay-1.54/examples/tcpecho.pl
Net-SSLeay-1.54/examples/x509_cert_details.pl
Net-SSLeay-1.54/examples/bulk.pl
Net-SSLeay-1.54/examples/req.conf
Net-SSLeay-1.54/examples/sslecho.pl
Net-SSLeay-1.54/examples/makecert.pl
Net-SSLeay-1.54/examples/get_authenticated_page.pl
Net-SSLeay-1.54/examples/ssl_diff.pl
Net-SSLeay-1.54/examples/minicli.pl
Net-SSLeay-1.54/examples/stdio_bulk.pl
CPAN: File::Temp loaded ok (v0.22)

  CPAN.pm: Going to build M/MI/MIKEM/Net-SSLeay-1.54.tar.gz

*** Found OpenSSL-1.0.0 installed in /usr
*** Be sure to use the same compiler and options to compile your OpenSSL, perl,
    and Net::SSLeay. Mixing and matching compilers is not supported.
Do you want to run external tests?
These tests *will* *fail* if you do not have network connectivity. [n] 
Checking if your kit is complete...
Looks good
Writing Makefile for Net::SSLeay
Could not read '/root/.cpan/build/Net-SSLeay-1.54-EpGdpr/META.yml'. Falling back to other methods to determine prerequisites
cp lib/Net/SSLeay.pm blib/lib/Net/SSLeay.pm
AutoSplitting blib/lib/Net/SSLeay.pm (blib/lib/auto/Net/SSLeay)
blib/lib/Net/SSLeay.pm: some names are not unique when truncated to 8 characters:
 directory blib/lib/auto/Net/SSLeay:
  do_https3.al, do_https2.al, do_https4.al, do_https.al truncate to do_https
  do_httpx3.al, do_httpx2.al, do_httpx4.al truncate to do_httpx
  get_https.al, get_https3.al, get_https4.al, get_http.al, get_http3.al, get_http4.al, get_httpx.al, get_httpx3.al, get_httpx4.al truncate to get_http
  head_https.al, head_https3.al, head_https4.al, head_http.al, head_http3.al, head_http4.al, head_httpx.al, head_httpx3.al, head_httpx4.al truncate to head_htt
  post_https.al, post_https3.al, post_https4.al, post_http.al, post_http3.al, post_http4.al, post_httpx.al, post_httpx3.al, post_httpx4.al truncate to post_htt
  put_https.al, put_https3.al, put_https4.al, put_http.al, put_http3.al, put_http4.al, put_httpx.al, put_httpx3.al, put_httpx4.al truncate to put_http
  ssl_read_all.al, ssl_read_until.al, ssl_read_CRLF.al truncate to ssl_read
  ssl_write_all.al, ssl_write_CRLF.al truncate to ssl_writ
  tcp_read_all.al, tcp_read_until.al, tcp_read_CRLF.al truncate to tcp_read
  tcp_write_all.al, tcp_write_CRLF.al truncate to tcp_writ
cp lib/Net/SSLeay.pod blib/lib/Net/SSLeay.pod
cp lib/Net/SSLeay/Handle.pm blib/lib/Net/SSLeay/Handle.pm
/usr/bin/perl "-Iinc" /usr/share/perl5/ExtUtils/xsubpp  -typemap /usr/share/perl5/ExtUtils/typemap -typemap typemap  SSLeay.xs > SSLeay.xsc && mv SSLeay.xsc SSLeay.c
gcc -c   -D_REENTRANT -D_GNU_SOURCE -fno-strict-aliasing -pipe -fstack-protector -I/usr/local/include -D_LARGEFILE_SOURCE -D_FILE_OFFSET_BITS=64 -O2 -g   -DVERSION=\"1.54\" -DXS_VERSION=\"1.54\" -fPIC "-I/usr/lib64/perl5/CORE"   SSLeay.c
SSLeay.xs:153:25: error: openssl/err.h: No such file or directory
SSLeay.xs:154:27: error: openssl/lhash.h: No such file or directory
SSLeay.xs:155:26: error: openssl/rand.h: No such file or directory
SSLeay.xs:156:28: error: openssl/buffer.h: No such file or directory
SSLeay.xs:157:25: error: openssl/ssl.h: No such file or directory
SSLeay.xs:158:28: error: openssl/pkcs12.h: No such file or directory
SSLeay.xs:159:74: error: openssl/comp.h: No such file or directory
SSLeay.xs:161:25: error: openssl/md2.h: No such file or directory
SSLeay.xs:163:25: error: openssl/md4.h: No such file or directory
SSLeay.xs:164:93: error: openssl/md5.h: No such file or directory
SSLeay.xs:168:26: error: openssl/x509.h: No such file or directory
SSLeay.xs:169:28: error: openssl/x509v3.h: No such file or directory
SSLeay.xs:353: error: expected ‘;’, ‘,’ or ‘)’ before ‘*’ token
SSLeay.xs:354: error: expected ‘=’, ‘,’, ‘;’, ‘asm’ or ‘__attribute__’ before ‘*’ token
SSLeay.xs:355: error: expected ‘=’, ‘,’, ‘;’, ‘asm’ or ‘__attribute__’ before ‘*’ token
SSLeay.xs:357: error: function definition declared ‘typedef’
SSLeay.xs: In function ‘STACK_OF’:
SSLeay.xs:357: error: expected declaration specifiers before ‘X509_NAME_STACK’
SSLeay.xs:359: error: storage class specified for parameter ‘perl_filehandle_t’
SSLeay.xs:418: warning: empty declaration
SSLeay.xs:422: error: storage class specified for parameter ‘simple_cb_data_t’
SSLeay.xs:424: error: expected declaration specifiers before ‘simple_cb_data_t’
SSLeay.xs:437: error: expected ‘)’ before ‘*’ token
SSLeay.xs:453: error: expected ‘=’, ‘,’, ‘;’, ‘asm’ or ‘__attribute__’ before ‘{’ token
SSLeay.xs:488: error: expected ‘=’, ‘,’, ‘;’, ‘asm’ or ‘__attribute__’ before ‘{’ token
SSLeay.xs:518: error: expected ‘=’, ‘,’, ‘;’, ‘asm’ or ‘__attribute__’ before ‘{’ token
SSLeay.xs:532: error: expected declaration specifiers or ‘...’ before ‘X509_STORE_CTX’
SSLeay.xs:533: error: expected ‘=’, ‘,’, ‘;’, ‘asm’ or ‘__attribute__’ before ‘{’ token
SSLeay.xs:581: error: expected ‘=’, ‘,’, ‘;’, ‘asm’ or ‘__attribute__’ before ‘{’ token
SSLeay.xs:625: error: expected ‘)’ before ‘*’ token
SSLeay.xs:934: error: expected ‘=’, ‘,’, ‘;’, ‘asm’ or ‘__attribute__’ before ‘{’ token
SSLeay.xs:982: error: expected ‘=’, ‘,’, ‘;’, ‘asm’ or ‘__attribute__’ before ‘{’ token
SSLeay.c:1079: error: expected ‘=’, ‘,’, ‘;’, ‘asm’ or ‘__attribute__’ before ‘{’ token
SSLeay.c:1105: error: expected ‘=’, ‘,’, ‘;’, ‘asm’ or ‘__attribute__’ before ‘{’ token
SSLeay.c:1129: error: expected ‘=’, ‘,’, ‘;’, ‘asm’ or ‘__attribute__’ before ‘{’ token
SSLeay.c:1153: error: expected ‘=’, ‘,’, ‘;’, ‘asm’ or ‘__attribute__’ before ‘{’ token
SSLeay.c:1174: error: expected ‘=’, ‘,’, ‘;’, ‘asm’ or ‘__attribute__’ before ‘{’ token
SSLeay.c:1203: error: expected ‘=’, ‘,’, ‘;’, ‘asm’ or ‘__attribute__’ before ‘{’ token
SSLeay.c:1229: error: expected ‘=’, ‘,’, ‘;’, ‘asm’ or ‘__attribute__’ before ‘{’ token
SSLeay.c:1253: error: expected ‘=’, ‘,’, ‘;’, ‘asm’ or ‘__attribute__’ before ‘{’ token
SSLeay.c:1275: error: expected ‘=’, ‘,’, ‘;’, ‘asm’ or ‘__attribute__’ before ‘{’ token
SSLeay.c:1297: error: expected ‘=’, ‘,’, ‘;’, ‘asm’ or ‘__attribute__’ before ‘{’ token
SSLeay.c:1319: error: expected ‘=’, ‘,’, ‘;’, ‘asm’ or ‘__attribute__’ before ‘{’ token
SSLeay.c:1342: error: expected ‘=’, ‘,’, ‘;’, ‘asm’ or ‘__attribute__’ before ‘{’ token
SSLeay.c:1363: error: expected ‘=’, ‘,’, ‘;’, ‘asm’ or ‘__attribute__’ before ‘{’ token
SSLeay.c:1386: error: expected ‘=’, ‘,’, ‘;’, ‘asm’ or ‘__attribute__’ before ‘{’ token
SSLeay.c:1409: error: expected ‘=’, ‘,’, ‘;’, ‘asm’ or ‘__attribute__’ before ‘{’ token
SSLeay.c:1429: error: expected ‘=’, ‘,’, ‘;’, ‘asm’ or ‘__attribute__’ before ‘{’ token
SSLeay.c:1451: error: expected ‘=’, ‘,’, ‘;’, ‘asm’ or ‘__attribute__’ before ‘{’ token
SSLeay.c:1479: error: expected ‘=’, ‘,’, ‘;’, ‘asm’ or ‘__attribute__’ before ‘{’ token
SSLeay.c:1520: error: expected ‘=’, ‘,’, ‘;’, ‘asm’ or ‘__attribute__’ before ‘{’ token
SSLeay.c:1544: error: expected ‘=’, ‘,’, ‘;’, ‘asm’ or ‘__attribute__’ before ‘{’ token
SSLeay.c:1566: error: expected ‘=’, ‘,’, ‘;’, ‘asm’ or ‘__attribute__’ before ‘{’ token
SSLeay.c:1610: error: expected ‘=’, ‘,’, ‘;’, ‘asm’ or ‘__attribute__’ before ‘{’ token
SSLeay.c:1632: error: expected ‘=’, ‘,’, ‘;’, ‘asm’ or ‘__attribute__’ before ‘{’ token
SSLeay.c:1651: error: expected ‘=’, ‘,’, ‘;’, ‘asm’ or ‘__attribute__’ before ‘{’ token
SSLeay.c:1769: error: expected ‘=’, ‘,’, ‘;’, ‘asm’ or ‘__attribute__’ before ‘{’ token
SSLeay.c:1798: error: expected ‘=’, ‘,’, ‘;’, ‘asm’ or ‘__attribute__’ before ‘{’ token
SSLeay.c:1827: error: expected ‘=’, ‘,’, ‘;’, ‘asm’ or ‘__attribute__’ before ‘{’ token
SSLeay.c:1857: error: expected ‘=’, ‘,’, ‘;’, ‘asm’ or ‘__attribute__’ before ‘{’ token
SSLeay.c:1879: error: expected ‘=’, ‘,’, ‘;’, ‘asm’ or ‘__attribute__’ before ‘{’ token
SSLeay.c:1932: error: expected ‘=’, ‘,’, ‘;’, ‘asm’ or ‘__attribute__’ before ‘{’ token
SSLeay.c:1967: error: expected ‘=’, ‘,’, ‘;’, ‘asm’ or ‘__attribute__’ before ‘{’ token
SSLeay.c:1994: error: expected ‘=’, ‘,’, ‘;’, ‘asm’ or ‘__attribute__’ before ‘{’ token
SSLeay.c:2039: error: expected ‘=’, ‘,’, ‘;’, ‘asm’ or ‘__attribute__’ before ‘{’ token
SSLeay.c:2062: error: expected ‘=’, ‘,’, ‘;’, ‘asm’ or ‘__attribute__’ before ‘{’ token
SSLeay.c:2086: error: expected ‘=’, ‘,’, ‘;’, ‘asm’ or ‘__attribute__’ before ‘{’ token
SSLeay.c:2110: error: expected ‘=’, ‘,’, ‘;’, ‘asm’ or ‘__attribute__’ before ‘{’ token
SSLeay.c:2134: error: expected ‘=’, ‘,’, ‘;’, ‘asm’ or ‘__attribute__’ before ‘{’ token
SSLeay.c:2157: error: expected ‘=’, ‘,’, ‘;’, ‘asm’ or ‘__attribute__’ before ‘{’ token
SSLeay.c:2182: error: expected ‘=’, ‘,’, ‘;’, ‘asm’ or ‘__attribute__’ before ‘{’ token
SSLeay.c:2206: error: expected ‘=’, ‘,’, ‘;’, ‘asm’ or ‘__attribute__’ before ‘{’ token
SSLeay.c:2230: error: expected ‘=’, ‘,’, ‘;’, ‘asm’ or ‘__attribute__’ before ‘{’ token
SSLeay.c:2253: error: expected ‘=’, ‘,’, ‘;’, ‘asm’ or ‘__attribute__’ before ‘{’ token
SSLeay.c:2277: error: expected ‘=’, ‘,’, ‘;’, ‘asm’ or ‘__attribute__’ before ‘{’ token
SSLeay.c:2301: error: expected ‘=’, ‘,’, ‘;’, ‘asm’ or ‘__attribute__’ before ‘{’ token
SSLeay.c:2325: error: expected ‘=’, ‘,’, ‘;’, ‘asm’ or ‘__attribute__’ before ‘{’ token
SSLeay.c:2347: error: expected ‘=’, ‘,’, ‘;’, ‘asm’ or ‘__attribute__’ before ‘{’ token
SSLeay.c:2369: error: expected ‘=’, ‘,’, ‘;’, ‘asm’ or ‘__attribute__’ before ‘{’ token
SSLeay.c:2391: error: expected ‘=’, ‘,’, ‘;’, ‘asm’ or ‘__attribute__’ before ‘{’ token
SSLeay.c:2413: error: expected ‘=’, ‘,’, ‘;’, ‘asm’ or ‘__attribute__’ before ‘{’ token
SSLeay.c:2435: error: expected ‘=’, ‘,’, ‘;’, ‘asm’ or ‘__attribute__’ before ‘{’ token
SSLeay.c:2458: error: expected ‘=’, ‘,’, ‘;’, ‘asm’ or ‘__attribute__’ before ‘{’ token
SSLeay.c:2480: error: expected ‘=’, ‘,’, ‘;’, ‘asm’ or ‘__attribute__’ before ‘{’ token
SSLeay.c:2503: error: expected ‘=’, ‘,’, ‘;’, ‘asm’ or ‘__attribute__’ before ‘{’ token
SSLeay.c:2523: error: expected ‘=’, ‘,’, ‘;’, ‘asm’ or ‘__attribute__’ before ‘{’ token
SSLeay.c:2549: error: expected ‘=’, ‘,’, ‘;’, ‘asm’ or ‘__attribute__’ before ‘{’ token
SSLeay.c:2571: error: expected ‘=’, ‘,’, ‘;’, ‘asm’ or ‘__attribute__’ before ‘{’ token
SSLeay.c:2593: error: expected ‘=’, ‘,’, ‘;’, ‘asm’ or ‘__attribute__’ before ‘{’ token
SSLeay.c:2616: error: expected ‘=’, ‘,’, ‘;’, ‘asm’ or ‘__attribute__’ before ‘{’ token
SSLeay.c:2639: error: expected ‘=’, ‘,’, ‘;’, ‘asm’ or ‘__attribute__’ before ‘{’ token
SSLeay.c:2662: error: expected ‘=’, ‘,’, ‘;’, ‘asm’ or ‘__attribute__’ before ‘{’ token
SSLeay.c:2684: error: expected ‘=’, ‘,’, ‘;’, ‘asm’ or ‘__attribute__’ before ‘{’ token
SSLeay.c:2723: error: expected ‘=’, ‘,’, ‘;’, ‘asm’ or ‘__attribute__’ before ‘{’ token
SSLeay.c:2745: error: expected ‘=’, ‘,’, ‘;’, ‘asm’ or ‘__attribute__’ before ‘{’ token
SSLeay.c:2774: error: expected ‘=’, ‘,’, ‘;’, ‘asm’ or ‘__attribute__’ before ‘{’ token
SSLeay.c:2795: error: expected ‘=’, ‘,’, ‘;’, ‘asm’ or ‘__attribute__’ before ‘{’ token
SSLeay.c:2817: error: expected ‘=’, ‘,’, ‘;’, ‘asm’ or ‘__attribute__’ before ‘{’ token
SSLeay.c:2839: error: expected ‘=’, ‘,’, ‘;’, ‘asm’ or ‘__attribute__’ before ‘{’ token
SSLeay.c:2860: error: expected ‘=’, ‘,’, ‘;’, ‘asm’ or ‘__attribute__’ before ‘{’ token
SSLeay.c:2883: error: expected ‘=’, ‘,’, ‘;’, ‘asm’ or ‘__attribute__’ before ‘{’ token
SSLeay.c:2902: error: expected ‘=’, ‘,’, ‘;’, ‘asm’ or ‘__attribute__’ before ‘{’ token
SSLeay.c:2925: error: expected ‘=’, ‘,’, ‘;’, ‘asm’ or ‘__attribute__’ before ‘{’ token
SSLeay.c:2952: error: expected ‘=’, ‘,’, ‘;’, ‘asm’ or ‘__attribute__’ before ‘{’ token
SSLeay.c:3005: error: expected ‘=’, ‘,’, ‘;’, ‘asm’ or ‘__attribute__’ before ‘{’ token
SSLeay.c:3028: error: expected ‘=’, ‘,’, ‘;’, ‘asm’ or ‘__attribute__’ before ‘{’ token
SSLeay.c:3050: error: expected ‘=’, ‘,’, ‘;’, ‘asm’ or ‘__attribute__’ before ‘{’ token
SSLeay.c:3147: error: expected ‘=’, ‘,’, ‘;’, ‘asm’ or ‘__attribute__’ before ‘{’ token
SSLeay.c:3172: error: expected ‘=’, ‘,’, ‘;’, ‘asm’ or ‘__attribute__’ before ‘{’ token
SSLeay.c:3194: error: expected ‘=’, ‘,’, ‘;’, ‘asm’ or ‘__attribute__’ before ‘{’ token
SSLeay.c:3217: error: expected ‘=’, ‘,’, ‘;’, ‘asm’ or ‘__attribute__’ before ‘{’ token
SSLeay.c:3239: error: expected ‘=’, ‘,’, ‘;’, ‘asm’ or ‘__attribute__’ before ‘{’ token
SSLeay.c:3290: error: expected ‘=’, ‘,’, ‘;’, ‘asm’ or ‘__attribute__’ before ‘{’ token
SSLeay.c:3316: error: expected ‘=’, ‘,’, ‘;’, ‘asm’ or ‘__attribute__’ before ‘{’ token
SSLeay.c:3338: error: expected ‘=’, ‘,’, ‘;’, ‘asm’ or ‘__attribute__’ before ‘{’ token
SSLeay.c:3360: error: expected ‘=’, ‘,’, ‘;’, ‘asm’ or ‘__attribute__’ before ‘{’ token
SSLeay.c:3382: error: expected ‘=’, ‘,’, ‘;’, ‘asm’ or ‘__attribute__’ before ‘{’ token
SSLeay.c:3404: error: expected ‘=’, ‘,’, ‘;’, ‘asm’ or ‘__attribute__’ before ‘{’ token
SSLeay.c:3426: error: expected ‘=’, ‘,’, ‘;’, ‘asm’ or ‘__attribute__’ before ‘{’ token
SSLeay.c:3448: error: expected ‘=’, ‘,’, ‘;’, ‘asm’ or ‘__attribute__’ before ‘{’ token
SSLeay.c:3470: error: expected ‘=’, ‘,’, ‘;’, ‘asm’ or ‘__attribute__’ before ‘{’ token
SSLeay.c:3492: error: expected ‘=’, ‘,’, ‘;’, ‘asm’ or ‘__attribute__’ before ‘{’ token
SSLeay.c:3514: error: expected ‘=’, ‘,’, ‘;’, ‘asm’ or ‘__attribute__’ before ‘{’ token
SSLeay.c:3536: error: expected ‘=’, ‘,’, ‘;’, ‘asm’ or ‘__attribute__’ before ‘{’ token
SSLeay.c:3558: error: expected ‘=’, ‘,’, ‘;’, ‘asm’ or ‘__attribute__’ before ‘{’ token
SSLeay.c:3580: error: expected ‘=’, ‘,’, ‘;’, ‘asm’ or ‘__attribute__’ before ‘{’ token
SSLeay.c:3602: error: expected ‘=’, ‘,’, ‘;’, ‘asm’ or ‘__attribute__’ before ‘{’ token
SSLeay.c:3625: error: expected ‘=’, ‘,’, ‘;’, ‘asm’ or ‘__attribute__’ before ‘{’ token
SSLeay.c:3647: error: expected ‘=’, ‘,’, ‘;’, ‘asm’ or ‘__attribute__’ before ‘{’ token
SSLeay.c:3791: error: expected ‘=’, ‘,’, ‘;’, ‘asm’ or ‘__attribute__’ before ‘{’ token
SSLeay.c:3812: error: expected ‘=’, ‘,’, ‘;’, ‘asm’ or ‘__attribute__’ before ‘{’ token
SSLeay.c:3833: error: expected ‘=’, ‘,’, ‘;’, ‘asm’ or ‘__attribute__’ before ‘{’ token
SSLeay.c:3854: error: expected ‘=’, ‘,’, ‘;’, ‘asm’ or ‘__attribute__’ before ‘{’ token
SSLeay.c:3875: error: expected ‘=’, ‘,’, ‘;’, ‘asm’ or ‘__attribute__’ before ‘{’ token
SSLeay.c:3898: error: expected ‘=’, ‘,’, ‘;’, ‘asm’ or ‘__attribute__’ before ‘{’ token
SSLeay.c:3916: error: expected ‘=’, ‘,’, ‘;’, ‘asm’ or ‘__attribute__’ before ‘{’ token
SSLeay.c:3946: error: expected ‘=’, ‘,’, ‘;’, ‘asm’ or ‘__attribute__’ before ‘{’ token
SSLeay.c:3964: error: expected ‘=’, ‘,’, ‘;’, ‘asm’ or ‘__attribute__’ before ‘{’ token
SSLeay.c:3982: error: expected ‘=’, ‘,’, ‘;’, ‘asm’ or ‘__attribute__’ before ‘{’ token
SSLeay.c:4021: error: expected ‘=’, ‘,’, ‘;’, ‘asm’ or ‘__attribute__’ before ‘{’ token
SSLeay.c:4140: error: expected ‘=’, ‘,’, ‘;’, ‘asm’ or ‘__attribute__’ before ‘{’ token
SSLeay.c:4158: error: expected ‘=’, ‘,’, ‘;’, ‘asm’ or ‘__attribute__’ before ‘{’ token
SSLeay.c:4176: error: expected ‘=’, ‘,’, ‘;’, ‘asm’ or ‘__attribute__’ before ‘{’ token
SSLeay.c:4208: error: expected ‘=’, ‘,’, ‘;’, ‘asm’ or ‘__attribute__’ before ‘{’ token
SSLeay.c:4240: error: expected ‘=’, ‘,’, ‘;’, ‘asm’ or ‘__attribute__’ before ‘{’ token
SSLeay.c:4265: error: expected ‘=’, ‘,’, ‘;’, ‘asm’ or ‘__attribute__’ before ‘{’ token
SSLeay.c:4286: error: expected ‘=’, ‘,’, ‘;’, ‘asm’ or ‘__attribute__’ before ‘{’ token
SSLeay.c:4307: error: expected ‘=’, ‘,’, ‘;’, ‘asm’ or ‘__attribute__’ before ‘{’ token
SSLeay.c:4330: error: expected ‘=’, ‘,’, ‘;’, ‘asm’ or ‘__attribute__’ before ‘{’ token
SSLeay.c:4362: error: expected ‘=’, ‘,’, ‘;’, ‘asm’ or ‘__attribute__’ before ‘{’ token
SSLeay.c:4385: error: expected ‘=’, ‘,’, ‘;’, ‘asm’ or ‘__attribute__’ before ‘{’ token
SSLeay.c:4403: error: expected ‘=’, ‘,’, ‘;’, ‘asm’ or ‘__attribute__’ before ‘{’ token
SSLeay.c:4426: error: expected ‘=’, ‘,’, ‘;’, ‘asm’ or ‘__attribute__’ before ‘{’ token
SSLeay.c:4448: error: expected ‘=’, ‘,’, ‘;’, ‘asm’ or ‘__attribute__’ before ‘{’ token
SSLeay.c:4471: error: expected ‘=’, ‘,’, ‘;’, ‘asm’ or ‘__attribute__’ before ‘{’ token
SSLeay.c:4493: error: expected ‘=’, ‘,’, ‘;’, ‘asm’ or ‘__attribute__’ before ‘{’ token
SSLeay.c:4515: error: expected ‘=’, ‘,’, ‘;’, ‘asm’ or ‘__attribute__’ before ‘{’ token
SSLeay.c:4538: error: expected ‘=’, ‘,’, ‘;’, ‘asm’ or ‘__attribute__’ before ‘{’ token
SSLeay.c:4561: error: expected ‘=’, ‘,’, ‘;’, ‘asm’ or ‘__attribute__’ before ‘{’ token
SSLeay.c:4584: error: expected ‘=’, ‘,’, ‘;’, ‘asm’ or ‘__attribute__’ before ‘{’ token
SSLeay.c:4607: error: expected ‘=’, ‘,’, ‘;’, ‘asm’ or ‘__attribute__’ before ‘{’ token
SSLeay.c:4629: error: expected ‘=’, ‘,’, ‘;’, ‘asm’ or ‘__attribute__’ before ‘{’ token
SSLeay.c:4651: error: expected ‘=’, ‘,’, ‘;’, ‘asm’ or ‘__attribute__’ before ‘{’ token
SSLeay.c:4673: error: expected ‘=’, ‘,’, ‘;’, ‘asm’ or ‘__attribute__’ before ‘{’ token
SSLeay.c:4696: error: expected ‘=’, ‘,’, ‘;’, ‘asm’ or ‘__attribute__’ before ‘{’ token
SSLeay.c:4725: error: expected ‘=’, ‘,’, ‘;’, ‘asm’ or ‘__attribute__’ before ‘{’ token
SSLeay.c:4749: error: expected ‘=’, ‘,’, ‘;’, ‘asm’ or ‘__attribute__’ before ‘{’ token
SSLeay.c:4772: error: expected ‘=’, ‘,’, ‘;’, ‘asm’ or ‘__attribute__’ before ‘{’ token
SSLeay.c:4799: error: expected ‘=’, ‘,’, ‘;’, ‘asm’ or ‘__attribute__’ before ‘{’ token
SSLeay.c:4854: error: expected ‘=’, ‘,’, ‘;’, ‘asm’ or ‘__attribute__’ before ‘{’ token
SSLeay.c:5021: error: expected ‘=’, ‘,’, ‘;’, ‘asm’ or ‘__attribute__’ before ‘{’ token
SSLeay.c:5044: error: expected ‘=’, ‘,’, ‘;’, ‘asm’ or ‘__attribute__’ before ‘{’ token
SSLeay.c:5066: error: expected ‘=’, ‘,’, ‘;’, ‘asm’ or ‘__attribute__’ before ‘{’ token
SSLeay.c:5089: error: expected ‘=’, ‘,’, ‘;’, ‘asm’ or ‘__attribute__’ before ‘{’ token
SSLeay.c:5111: error: expected ‘=’, ‘,’, ‘;’, ‘asm’ or ‘__attribute__’ before ‘{’ token
SSLeay.c:5133: error: expected ‘=’, ‘,’, ‘;’, ‘asm’ or ‘__attribute__’ before ‘{’ token
SSLeay.c:5152: error: expected ‘=’, ‘,’, ‘;’, ‘asm’ or ‘__attribute__’ before ‘{’ token
SSLeay.c:5292: error: expected ‘=’, ‘,’, ‘;’, ‘asm’ or ‘__attribute__’ before ‘{’ token
SSLeay.c:5314: error: expected ‘=’, ‘,’, ‘;’, ‘asm’ or ‘__attribute__’ before ‘{’ token
SSLeay.c:5336: error: expected ‘=’, ‘,’, ‘;’, ‘asm’ or ‘__attribute__’ before ‘{’ token
SSLeay.c:5358: error: expected ‘=’, ‘,’, ‘;’, ‘asm’ or ‘__attribute__’ before ‘{’ token
SSLeay.c:5380: error: expected ‘=’, ‘,’, ‘;’, ‘asm’ or ‘__attribute__’ before ‘{’ token
SSLeay.c:5403: error: expected ‘=’, ‘,’, ‘;’, ‘asm’ or ‘__attribute__’ before ‘{’ token
SSLeay.c:5566: error: expected ‘=’, ‘,’, ‘;’, ‘asm’ or ‘__attribute__’ before ‘{’ token
SSLeay.c:5587: error: expected ‘=’, ‘,’, ‘;’, ‘asm’ or ‘__attribute__’ before ‘{’ token
SSLeay.c:5606: error: expected ‘=’, ‘,’, ‘;’, ‘asm’ or ‘__attribute__’ before ‘{’ token
SSLeay.c:5628: error: expected ‘=’, ‘,’, ‘;’, ‘asm’ or ‘__attribute__’ before ‘{’ token
SSLeay.c:5651: error: expected ‘=’, ‘,’, ‘;’, ‘asm’ or ‘__attribute__’ before ‘{’ token
SSLeay.c:5674: error: expected ‘=’, ‘,’, ‘;’, ‘asm’ or ‘__attribute__’ before ‘{’ token
SSLeay.c:5696: error: expected ‘=’, ‘,’, ‘;’, ‘asm’ or ‘__attribute__’ before ‘{’ token
SSLeay.c:5720: error: expected ‘=’, ‘,’, ‘;’, ‘asm’ or ‘__attribute__’ before ‘{’ token
SSLeay.c:5743: error: expected ‘=’, ‘,’, ‘;’, ‘asm’ or ‘__attribute__’ before ‘{’ token
SSLeay.c:5766: error: expected ‘=’, ‘,’, ‘;’, ‘asm’ or ‘__attribute__’ before ‘{’ token
SSLeay.c:5788: error: expected ‘=’, ‘,’, ‘;’, ‘asm’ or ‘__attribute__’ before ‘{’ token
SSLeay.c:5810: error: expected ‘=’, ‘,’, ‘;’, ‘asm’ or ‘__attribute__’ before ‘{’ token
SSLeay.c:5840: error: expected ‘=’, ‘,’, ‘;’, ‘asm’ or ‘__attribute__’ before ‘{’ token
SSLeay.c:5870: error: expected ‘=’, ‘,’, ‘;’, ‘asm’ or ‘__attribute__’ before ‘{’ token
SSLeay.c:5944: error: expected ‘=’, ‘,’, ‘;’, ‘asm’ or ‘__attribute__’ before ‘{’ token
SSLeay.c:5991: error: expected ‘=’, ‘,’, ‘;’, ‘asm’ or ‘__attribute__’ before ‘{’ token
SSLeay.c:6042: error: expected ‘=’, ‘,’, ‘;’, ‘asm’ or ‘__attribute__’ before ‘{’ token
SSLeay.c:6099: error: expected ‘=’, ‘,’, ‘;’, ‘asm’ or ‘__attribute__’ before ‘{’ token
SSLeay.c:6121: error: expected ‘=’, ‘,’, ‘;’, ‘asm’ or ‘__attribute__’ before ‘{’ token
SSLeay.c:6144: error: expected ‘=’, ‘,’, ‘;’, ‘asm’ or ‘__attribute__’ before ‘{’ token
SSLeay.c:6203: error: expected ‘=’, ‘,’, ‘;’, ‘asm’ or ‘__attribute__’ before ‘{’ token
SSLeay.c:6401: error: expected ‘=’, ‘,’, ‘;’, ‘asm’ or ‘__attribute__’ before ‘{’ token
SSLeay.c:6438: error: expected ‘=’, ‘,’, ‘;’, ‘asm’ or ‘__attribute__’ before ‘{’ token
SSLeay.c:6474: error: expected ‘=’, ‘,’, ‘;’, ‘asm’ or ‘__attribute__’ before ‘{’ token
SSLeay.c:6504: error: expected ‘=’, ‘,’, ‘;’, ‘asm’ or ‘__attribute__’ before ‘{’ token
SSLeay.c:6527: error: expected ‘=’, ‘,’, ‘;’, ‘asm’ or ‘__attribute__’ before ‘{’ token
SSLeay.c:6549: error: expected ‘=’, ‘,’, ‘;’, ‘asm’ or ‘__attribute__’ before ‘{’ token
SSLeay.c:6571: error: expected ‘=’, ‘,’, ‘;’, ‘asm’ or ‘__attribute__’ before ‘{’ token
SSLeay.c:6593: error: expected ‘=’, ‘,’, ‘;’, ‘asm’ or ‘__attribute__’ before ‘{’ token
SSLeay.c:6615: error: expected ‘=’, ‘,’, ‘;’, ‘asm’ or ‘__attribute__’ before ‘{’ token
SSLeay.c:6671: error: expected ‘=’, ‘,’, ‘;’, ‘asm’ or ‘__attribute__’ before ‘{’ token
SSLeay.c:6693: error: expected ‘=’, ‘,’, ‘;’, ‘asm’ or ‘__attribute__’ before ‘{’ token
SSLeay.c:6715: error: expected ‘=’, ‘,’, ‘;’, ‘asm’ or ‘__attribute__’ before ‘{’ token
SSLeay.c:6737: error: expected ‘=’, ‘,’, ‘;’, ‘asm’ or ‘__attribute__’ before ‘{’ token
SSLeay.c:6761: error: expected ‘=’, ‘,’, ‘;’, ‘asm’ or ‘__attribute__’ before ‘{’ token
SSLeay.c:6781: error: expected ‘=’, ‘,’, ‘;’, ‘asm’ or ‘__attribute__’ before ‘{’ token
SSLeay.c:6801: error: expected ‘=’, ‘,’, ‘;’, ‘asm’ or ‘__attribute__’ before ‘{’ token
SSLeay.c:6824: error: expected ‘=’, ‘,’, ‘;’, ‘asm’ or ‘__attribute__’ before ‘{’ token
SSLeay.c:6934: error: expected ‘=’, ‘,’, ‘;’, ‘asm’ or ‘__attribute__’ before ‘{’ token
SSLeay.c:6958: error: expected ‘=’, ‘,’, ‘;’, ‘asm’ or ‘__attribute__’ before ‘{’ token
SSLeay.c:6982: error: expected ‘=’, ‘,’, ‘;’, ‘asm’ or ‘__attribute__’ before ‘{’ token
SSLeay.c:7006: error: expected ‘=’, ‘,’, ‘;’, ‘asm’ or ‘__attribute__’ before ‘{’ token
SSLeay.c:7028: error: expected ‘=’, ‘,’, ‘;’, ‘asm’ or ‘__attribute__’ before ‘{’ token
SSLeay.c:7049: error: expected ‘=’, ‘,’, ‘;’, ‘asm’ or ‘__attribute__’ before ‘{’ token
SSLeay.c:7068: error: expected ‘=’, ‘,’, ‘;’, ‘asm’ or ‘__attribute__’ before ‘{’ token
SSLeay.c:7091: error: expected ‘=’, ‘,’, ‘;’, ‘asm’ or ‘__attribute__’ before ‘{’ token
SSLeay.c:7113: error: expected ‘=’, ‘,’, ‘;’, ‘asm’ or ‘__attribute__’ before ‘{’ token
SSLeay.c:7145: error: expected ‘=’, ‘,’, ‘;’, ‘asm’ or ‘__attribute__’ before ‘{’ token
SSLeay.c:7177: error: expected ‘=’, ‘,’, ‘;’, ‘asm’ or ‘__attribute__’ before ‘{’ token
SSLeay.c:7211: error: expected ‘=’, ‘,’, ‘;’, ‘asm’ or ‘__attribute__’ before ‘{’ token
SSLeay.c:7245: error: expected ‘=’, ‘,’, ‘;’, ‘asm’ or ‘__attribute__’ before ‘{’ token
SSLeay.c:7280: error: expected ‘=’, ‘,’, ‘;’, ‘asm’ or ‘__attribute__’ before ‘{’ token
SSLeay.c:7302: error: expected ‘=’, ‘,’, ‘;’, ‘asm’ or ‘__attribute__’ before ‘{’ token
SSLeay.c:7324: error: expected ‘=’, ‘,’, ‘;’, ‘asm’ or ‘__attribute__’ before ‘{’ token
SSLeay.c:7347: error: expected ‘=’, ‘,’, ‘;’, ‘asm’ or ‘__attribute__’ before ‘{’ token
SSLeay.c:7370: error: expected ‘=’, ‘,’, ‘;’, ‘asm’ or ‘__attribute__’ before ‘{’ token
SSLeay.c:7389: error: expected ‘=’, ‘,’, ‘;’, ‘asm’ or ‘__attribute__’ before ‘{’ token
SSLeay.c:7410: error: expected ‘=’, ‘,’, ‘;’, ‘asm’ or ‘__attribute__’ before ‘{’ token
SSLeay.c:7557: error: expected ‘=’, ‘,’, ‘;’, ‘asm’ or ‘__attribute__’ before ‘{’ token
SSLeay.c:7580: error: expected ‘=’, ‘,’, ‘;’, ‘asm’ or ‘__attribute__’ before ‘{’ token
SSLeay.c:7601: error: expected ‘=’, ‘,’, ‘;’, ‘asm’ or ‘__attribute__’ before ‘{’ token
SSLeay.c:7620: error: expected ‘=’, ‘,’, ‘;’, ‘asm’ or ‘__attribute__’ before ‘{’ token
SSLeay.c:7643: error: expected ‘=’, ‘,’, ‘;’, ‘asm’ or ‘__attribute__’ before ‘{’ token
SSLeay.c:7665: error: expected ‘=’, ‘,’, ‘;’, ‘asm’ or ‘__attribute__’ before ‘{’ token
SSLeay.c:7713: error: expected ‘=’, ‘,’, ‘;’, ‘asm’ or ‘__attribute__’ before ‘{’ token
SSLeay.c:7750: error: expected ‘=’, ‘,’, ‘;’, ‘asm’ or ‘__attribute__’ before ‘{’ token
SSLeay.c:7787: error: expected ‘=’, ‘,’, ‘;’, ‘asm’ or ‘__attribute__’ before ‘{’ token
SSLeay.c:7824: error: expected ‘=’, ‘,’, ‘;’, ‘asm’ or ‘__attribute__’ before ‘{’ token
SSLeay.c:7889: error: expected ‘=’, ‘,’, ‘;’, ‘asm’ or ‘__attribute__’ before ‘{’ token
SSLeay.c:7948: error: expected ‘=’, ‘,’, ‘;’, ‘asm’ or ‘__attribute__’ before ‘{’ token
SSLeay.c:8028: error: expected ‘=’, ‘,’, ‘;’, ‘asm’ or ‘__attribute__’ before ‘{’ token
SSLeay.c:8059: error: expected ‘=’, ‘,’, ‘;’, ‘asm’ or ‘__attribute__’ before ‘{’ token
SSLeay.c:8087: error: expected ‘=’, ‘,’, ‘;’, ‘asm’ or ‘__attribute__’ before ‘{’ token
SSLeay.c:8150: error: expected ‘=’, ‘,’, ‘;’, ‘asm’ or ‘__attribute__’ before ‘{’ token
SSLeay.c:8247: error: expected ‘=’, ‘,’, ‘;’, ‘asm’ or ‘__attribute__’ before ‘{’ token
SSLeay.c:8270: error: expected ‘=’, ‘,’, ‘;’, ‘asm’ or ‘__attribute__’ before ‘{’ token
SSLeay.c:8291: error: expected ‘=’, ‘,’, ‘;’, ‘asm’ or ‘__attribute__’ before ‘{’ token
SSLeay.c:8315: error: expected ‘=’, ‘,’, ‘;’, ‘asm’ or ‘__attribute__’ before ‘{’ token
SSLeay.c:8365: error: expected ‘=’, ‘,’, ‘;’, ‘asm’ or ‘__attribute__’ before ‘{’ token
SSLeay.c:8388: error: expected ‘=’, ‘,’, ‘;’, ‘asm’ or ‘__attribute__’ before ‘{’ token
SSLeay.c:8410: error: expected ‘=’, ‘,’, ‘;’, ‘asm’ or ‘__attribute__’ before ‘{’ token
SSLeay.c:8433: error: expected ‘=’, ‘,’, ‘;’, ‘asm’ or ‘__attribute__’ before ‘{’ token
SSLeay.c:8456: error: expected ‘=’, ‘,’, ‘;’, ‘asm’ or ‘__attribute__’ before ‘{’ token
SSLeay.c:8478: error: expected ‘=’, ‘,’, ‘;’, ‘asm’ or ‘__attribute__’ before ‘{’ token
SSLeay.c:8500: error: expected ‘=’, ‘,’, ‘;’, ‘asm’ or ‘__attribute__’ before ‘{’ token
SSLeay.c:8522: error: expected ‘=’, ‘,’, ‘;’, ‘asm’ or ‘__attribute__’ before ‘{’ token
SSLeay.c:8557: error: expected ‘=’, ‘,’, ‘;’, ‘asm’ or ‘__attribute__’ before ‘{’ token
SSLeay.c:8584: error: expected ‘=’, ‘,’, ‘;’, ‘asm’ or ‘__attribute__’ before ‘{’ token
SSLeay.c:8606: error: expected ‘=’, ‘,’, ‘;’, ‘asm’ or ‘__attribute__’ before ‘{’ token
SSLeay.c:8628: error: expected ‘=’, ‘,’, ‘;’, ‘asm’ or ‘__attribute__’ before ‘{’ token
SSLeay.c:8650: error: expected ‘=’, ‘,’, ‘;’, ‘asm’ or ‘__attribute__’ before ‘{’ token
SSLeay.c:8673: error: expected ‘=’, ‘,’, ‘;’, ‘asm’ or ‘__attribute__’ before ‘{’ token
SSLeay.c:8692: error: expected ‘=’, ‘,’, ‘;’, ‘asm’ or ‘__attribute__’ before ‘{’ token
SSLeay.c:8715: error: expected ‘=’, ‘,’, ‘;’, ‘asm’ or ‘__attribute__’ before ‘{’ token
SSLeay.c:8737: error: expected ‘=’, ‘,’, ‘;’, ‘asm’ or ‘__attribute__’ before ‘{’ token
SSLeay.c:8759: error: expected ‘=’, ‘,’, ‘;’, ‘asm’ or ‘__attribute__’ before ‘{’ token
SSLeay.c:8781: error: expected ‘=’, ‘,’, ‘;’, ‘asm’ or ‘__attribute__’ before ‘{’ token
SSLeay.c:8803: error: expected ‘=’, ‘,’, ‘;’, ‘asm’ or ‘__attribute__’ before ‘{’ token
SSLeay.c:8827: error: expected ‘=’, ‘,’, ‘;’, ‘asm’ or ‘__attribute__’ before ‘{’ token
SSLeay.c:8853: error: expected ‘=’, ‘,’, ‘;’, ‘asm’ or ‘__attribute__’ before ‘{’ token
SSLeay.c:8909: error: expected ‘=’, ‘,’, ‘;’, ‘asm’ or ‘__attribute__’ before ‘{’ token
SSLeay.c:8931: error: expected ‘=’, ‘,’, ‘;’, ‘asm’ or ‘__attribute__’ before ‘{’ token
SSLeay.c:9015: error: expected ‘=’, ‘,’, ‘;’, ‘asm’ or ‘__attribute__’ before ‘{’ token
SSLeay.c:9038: error: expected ‘=’, ‘,’, ‘;’, ‘asm’ or ‘__attribute__’ before ‘{’ token
SSLeay.c:9061: error: expected ‘=’, ‘,’, ‘;’, ‘asm’ or ‘__attribute__’ before ‘{’ token
SSLeay.c:9085: error: expected ‘=’, ‘,’, ‘;’, ‘asm’ or ‘__attribute__’ before ‘{’ token
SSLeay.c:9107: error: expected ‘=’, ‘,’, ‘;’, ‘asm’ or ‘__attribute__’ before ‘{’ token
SSLeay.c:9130: error: expected ‘=’, ‘,’, ‘;’, ‘asm’ or ‘__attribute__’ before ‘{’ token
SSLeay.c:9152: error: expected ‘=’, ‘,’, ‘;’, ‘asm’ or ‘__attribute__’ before ‘{’ token
SSLeay.c:9174: error: expected ‘=’, ‘,’, ‘;’, ‘asm’ or ‘__attribute__’ before ‘{’ token
SSLeay.c:9196: error: expected ‘=’, ‘,’, ‘;’, ‘asm’ or ‘__attribute__’ before ‘{’ token
SSLeay.c:9218: error: expected ‘=’, ‘,’, ‘;’, ‘asm’ or ‘__attribute__’ before ‘{’ token
SSLeay.c:9238: error: expected ‘=’, ‘,’, ‘;’, ‘asm’ or ‘__attribute__’ before ‘{’ token
SSLeay.c:9260: error: expected ‘=’, ‘,’, ‘;’, ‘asm’ or ‘__attribute__’ before ‘{’ token
SSLeay.c:9301: error: expected ‘=’, ‘,’, ‘;’, ‘asm’ or ‘__attribute__’ before ‘{’ token
SSLeay.c:9323: error: expected ‘=’, ‘,’, ‘;’, ‘asm’ or ‘__attribute__’ before ‘{’ token
SSLeay.c:9343: error: expected ‘=’, ‘,’, ‘;’, ‘asm’ or ‘__attribute__’ before ‘{’ token
SSLeay.c:9379: error: expected ‘=’, ‘,’, ‘;’, ‘asm’ or ‘__attribute__’ before ‘{’ token
SSLeay.c:9412: error: expected ‘=’, ‘,’, ‘;’, ‘asm’ or ‘__attribute__’ before ‘{’ token
SSLeay.c:9436: error: expected ‘=’, ‘,’, ‘;’, ‘asm’ or ‘__attribute__’ before ‘{’ token
SSLeay.c:9459: error: expected ‘=’, ‘,’, ‘;’, ‘asm’ or ‘__attribute__’ before ‘{’ token
SSLeay.c:9482: error: expected ‘=’, ‘,’, ‘;’, ‘asm’ or ‘__attribute__’ before ‘{’ token
SSLeay.c:9532: error: expected ‘=’, ‘,’, ‘;’, ‘asm’ or ‘__attribute__’ before ‘{’ token
SSLeay.c:9555: error: expected ‘=’, ‘,’, ‘;’, ‘asm’ or ‘__attribute__’ before ‘{’ token
SSLeay.c:9578: error: expected ‘=’, ‘,’, ‘;’, ‘asm’ or ‘__attribute__’ before ‘{’ token
SSLeay.c:9598: error: expected ‘=’, ‘,’, ‘;’, ‘asm’ or ‘__attribute__’ before ‘{’ token
SSLeay.c:9621: error: expected ‘=’, ‘,’, ‘;’, ‘asm’ or ‘__attribute__’ before ‘{’ token
SSLeay.c:9644: error: expected ‘=’, ‘,’, ‘;’, ‘asm’ or ‘__attribute__’ before ‘{’ token
SSLeay.c:9667: error: expected ‘=’, ‘,’, ‘;’, ‘asm’ or ‘__attribute__’ before ‘{’ token
SSLeay.c:9690: error: expected ‘=’, ‘,’, ‘;’, ‘asm’ or ‘__attribute__’ before ‘{’ token
SSLeay.c:9712: error: expected ‘=’, ‘,’, ‘;’, ‘asm’ or ‘__attribute__’ before ‘{’ token
SSLeay.c:9734: error: expected ‘=’, ‘,’, ‘;’, ‘asm’ or ‘__attribute__’ before ‘{’ token
SSLeay.c:9756: error: expected ‘=’, ‘,’, ‘;’, ‘asm’ or ‘__attribute__’ before ‘{’ token
SSLeay.c:9778: error: expected ‘=’, ‘,’, ‘;’, ‘asm’ or ‘__attribute__’ before ‘{’ token
SSLeay.c:9801: error: expected ‘=’, ‘,’, ‘;’, ‘asm’ or ‘__attribute__’ before ‘{’ token
SSLeay.c:9825: error: expected ‘=’, ‘,’, ‘;’, ‘asm’ or ‘__attribute__’ before ‘{’ token
SSLeay.c:9849: error: expected ‘=’, ‘,’, ‘;’, ‘asm’ or ‘__attribute__’ before ‘{’ token
SSLeay.c:9871: error: expected ‘=’, ‘,’, ‘;’, ‘asm’ or ‘__attribute__’ before ‘{’ token
SSLeay.c:9893: error: expected ‘=’, ‘,’, ‘;’, ‘asm’ or ‘__attribute__’ before ‘{’ token
SSLeay.c:9915: error: expected ‘=’, ‘,’, ‘;’, ‘asm’ or ‘__attribute__’ before ‘{’ token
SSLeay.c:9937: error: expected ‘=’, ‘,’, ‘;’, ‘asm’ or ‘__attribute__’ before ‘{’ token
SSLeay.c:9959: error: expected ‘=’, ‘,’, ‘;’, ‘asm’ or ‘__attribute__’ before ‘{’ token
SSLeay.c:9984: error: expected ‘=’, ‘,’, ‘;’, ‘asm’ or ‘__attribute__’ before ‘{’ token
SSLeay.c:10008: error: expected ‘=’, ‘,’, ‘;’, ‘asm’ or ‘__attribute__’ before ‘{’ token
SSLeay.c:10031: error: expected ‘=’, ‘,’, ‘;’, ‘asm’ or ‘__attribute__’ before ‘{’ token
SSLeay.c:10053: error: expected ‘=’, ‘,’, ‘;’, ‘asm’ or ‘__attribute__’ before ‘{’ token
SSLeay.c:10075: error: expected ‘=’, ‘,’, ‘;’, ‘asm’ or ‘__attribute__’ before ‘{’ token
SSLeay.c:10098: error: expected ‘=’, ‘,’, ‘;’, ‘asm’ or ‘__attribute__’ before ‘{’ token
SSLeay.c:10122: error: expected ‘=’, ‘,’, ‘;’, ‘asm’ or ‘__attribute__’ before ‘{’ token
SSLeay.c:10145: error: expected ‘=’, ‘,’, ‘;’, ‘asm’ or ‘__attribute__’ before ‘{’ token
SSLeay.c:10168: error: expected ‘=’, ‘,’, ‘;’, ‘asm’ or ‘__attribute__’ before ‘{’ token
SSLeay.c:10187: error: expected ‘=’, ‘,’, ‘;’, ‘asm’ or ‘__attribute__’ before ‘{’ token
SSLeay.c:10206: error: expected ‘=’, ‘,’, ‘;’, ‘asm’ or ‘__attribute__’ before ‘{’ token
SSLeay.c:10228: error: expected ‘=’, ‘,’, ‘;’, ‘asm’ or ‘__attribute__’ before ‘{’ token
SSLeay.c:10251: error: expected ‘=’, ‘,’, ‘;’, ‘asm’ or ‘__attribute__’ before ‘{’ token
SSLeay.c:10273: error: expected ‘=’, ‘,’, ‘;’, ‘asm’ or ‘__attribute__’ before ‘{’ token
SSLeay.c:10293: error: expected ‘=’, ‘,’, ‘;’, ‘asm’ or ‘__attribute__’ before ‘{’ token
SSLeay.c:10312: error: expected ‘=’, ‘,’, ‘;’, ‘asm’ or ‘__attribute__’ before ‘{’ token
SSLeay.c:10336: error: expected ‘=’, ‘,’, ‘;’, ‘asm’ or ‘__attribute__’ before ‘{’ token
SSLeay.c:10356: error: expected ‘=’, ‘,’, ‘;’, ‘asm’ or ‘__attribute__’ before ‘{’ token
SSLeay.c:10379: error: expected ‘=’, ‘,’, ‘;’, ‘asm’ or ‘__attribute__’ before ‘{’ token
SSLeay.c:10399: error: expected ‘=’, ‘,’, ‘;’, ‘asm’ or ‘__attribute__’ before ‘{’ token
SSLeay.c:10419: error: expected ‘=’, ‘,’, ‘;’, ‘asm’ or ‘__attribute__’ before ‘{’ token
SSLeay.c:10442: error: expected ‘=’, ‘,’, ‘;’, ‘asm’ or ‘__attribute__’ before ‘{’ token
SSLeay.c:10462: error: expected ‘=’, ‘,’, ‘;’, ‘asm’ or ‘__attribute__’ before ‘{’ token
SSLeay.c:10482: error: expected ‘=’, ‘,’, ‘;’, ‘asm’ or ‘__attribute__’ before ‘{’ token
SSLeay.c:10504: error: expected ‘=’, ‘,’, ‘;’, ‘asm’ or ‘__attribute__’ before ‘{’ token
SSLeay.c:10527: error: expected ‘=’, ‘,’, ‘;’, ‘asm’ or ‘__attribute__’ before ‘{’ token
SSLeay.c:10549: error: expected ‘=’, ‘,’, ‘;’, ‘asm’ or ‘__attribute__’ before ‘{’ token
SSLeay.c:10577: error: expected ‘=’, ‘,’, ‘;’, ‘asm’ or ‘__attribute__’ before ‘{’ token
SSLeay.c:10603: error: expected ‘=’, ‘,’, ‘;’, ‘asm’ or ‘__attribute__’ before ‘{’ token
SSLeay.c:10629: error: expected ‘=’, ‘,’, ‘;’, ‘asm’ or ‘__attribute__’ before ‘{’ token
SSLeay.c:10653: error: expected ‘=’, ‘,’, ‘;’, ‘asm’ or ‘__attribute__’ before ‘{’ token
SSLeay.c:10677: error: expected ‘=’, ‘,’, ‘;’, ‘asm’ or ‘__attribute__’ before ‘{’ token
SSLeay.c:10697: error: expected ‘=’, ‘,’, ‘;’, ‘asm’ or ‘__attribute__’ before ‘{’ token
SSLeay.c:10717: error: expected ‘=’, ‘,’, ‘;’, ‘asm’ or ‘__attribute__’ before ‘{’ token
SSLeay.c:10737: error: expected ‘=’, ‘,’, ‘;’, ‘asm’ or ‘__attribute__’ before ‘{’ token
SSLeay.c:10757: error: expected ‘=’, ‘,’, ‘;’, ‘asm’ or ‘__attribute__’ before ‘{’ token
SSLeay.c:10783: error: expected ‘=’, ‘,’, ‘;’, ‘asm’ or ‘__attribute__’ before ‘{’ token
SSLeay.c:10810: error: expected ‘=’, ‘,’, ‘;’, ‘asm’ or ‘__attribute__’ before ‘{’ token
SSLeay.c:10833: error: expected ‘=’, ‘,’, ‘;’, ‘asm’ or ‘__attribute__’ before ‘{’ token
SSLeay.c:10857: error: expected ‘=’, ‘,’, ‘;’, ‘asm’ or ‘__attribute__’ before ‘{’ token
SSLeay.c:10880: error: expected ‘=’, ‘,’, ‘;’, ‘asm’ or ‘__attribute__’ before ‘{’ token
SSLeay.c:10903: error: expected ‘=’, ‘,’, ‘;’, ‘asm’ or ‘__attribute__’ before ‘{’ token
SSLeay.c:10926: error: expected ‘=’, ‘,’, ‘;’, ‘asm’ or ‘__attribute__’ before ‘{’ token
SSLeay.c:10949: error: expected ‘=’, ‘,’, ‘;’, ‘asm’ or ‘__attribute__’ before ‘{’ token
SSLeay.c:10972: error: expected ‘=’, ‘,’, ‘;’, ‘asm’ or ‘__attribute__’ before ‘{’ token
SSLeay.c:10996: error: expected ‘=’, ‘,’, ‘;’, ‘asm’ or ‘__attribute__’ before ‘{’ token
SSLeay.c:11020: error: expected ‘=’, ‘,’, ‘;’, ‘asm’ or ‘__attribute__’ before ‘{’ token
SSLeay.c:11044: error: expected ‘=’, ‘,’, ‘;’, ‘asm’ or ‘__attribute__’ before ‘{’ token
SSLeay.c:11068: error: expected ‘=’, ‘,’, ‘;’, ‘asm’ or ‘__attribute__’ before ‘{’ token
SSLeay.c:11091: error: expected ‘=’, ‘,’, ‘;’, ‘asm’ or ‘__attribute__’ before ‘{’ token
SSLeay.c:11114: error: expected ‘=’, ‘,’, ‘;’, ‘asm’ or ‘__attribute__’ before ‘{’ token
SSLeay.c:11137: error: expected ‘=’, ‘,’, ‘;’, ‘asm’ or ‘__attribute__’ before ‘{’ token
SSLeay.c:11167: error: expected ‘=’, ‘,’, ‘;’, ‘asm’ or ‘__attribute__’ before ‘{’ token
SSLeay.c:11190: error: expected ‘=’, ‘,’, ‘;’, ‘asm’ or ‘__attribute__’ before ‘{’ token
SSLeay.c:11213: error: expected ‘=’, ‘,’, ‘;’, ‘asm’ or ‘__attribute__’ before ‘{’ token
SSLeay.c:11236: error: expected ‘=’, ‘,’, ‘;’, ‘asm’ or ‘__attribute__’ before ‘{’ token
SSLeay.c:11259: error: expected ‘=’, ‘,’, ‘;’, ‘asm’ or ‘__attribute__’ before ‘{’ token
SSLeay.c:11282: error: expected ‘=’, ‘,’, ‘;’, ‘asm’ or ‘__attribute__’ before ‘{’ token
SSLeay.c:11305: error: expected ‘=’, ‘,’, ‘;’, ‘asm’ or ‘__attribute__’ before ‘{’ token
SSLeay.c:11329: error: expected ‘=’, ‘,’, ‘;’, ‘asm’ or ‘__attribute__’ before ‘{’ token
SSLeay.c:11353: error: expected ‘=’, ‘,’, ‘;’, ‘asm’ or ‘__attribute__’ before ‘{’ token
SSLeay.c:11377: error: expected ‘=’, ‘,’, ‘;’, ‘asm’ or ‘__attribute__’ before ‘{’ token
SSLeay.c:11401: error: expected ‘=’, ‘,’, ‘;’, ‘asm’ or ‘__attribute__’ before ‘{’ token
SSLeay.c:11424: error: expected ‘=’, ‘,’, ‘;’, ‘asm’ or ‘__attribute__’ before ‘{’ token
SSLeay.c:11448: error: expected ‘=’, ‘,’, ‘;’, ‘asm’ or ‘__attribute__’ before ‘{’ token
SSLeay.c:11491: error: expected ‘=’, ‘,’, ‘;’, ‘asm’ or ‘__attribute__’ before ‘{’ token
SSLeay.c:11510: error: expected ‘=’, ‘,’, ‘;’, ‘asm’ or ‘__attribute__’ before ‘{’ token
SSLeay.c:11531: error: expected ‘=’, ‘,’, ‘;’, ‘asm’ or ‘__attribute__’ before ‘{’ token
SSLeay.c:11550: error: expected ‘=’, ‘,’, ‘;’, ‘asm’ or ‘__attribute__’ before ‘{’ token
SSLeay.c:11579: error: expected ‘=’, ‘,’, ‘;’, ‘asm’ or ‘__attribute__’ before ‘{’ token
SSLeay.c:11608: error: expected ‘=’, ‘,’, ‘;’, ‘asm’ or ‘__attribute__’ before ‘{’ token
SSLeay.c:11637: error: expected ‘=’, ‘,’, ‘;’, ‘asm’ or ‘__attribute__’ before ‘{’ token
SSLeay.c:11680: error: expected ‘=’, ‘,’, ‘;’, ‘asm’ or ‘__attribute__’ before ‘{’ token
SSLeay.c:11723: error: expected ‘=’, ‘,’, ‘;’, ‘asm’ or ‘__attribute__’ before ‘{’ token
SSLeay.c:11766: error: expected ‘=’, ‘,’, ‘;’, ‘asm’ or ‘__attribute__’ before ‘{’ token
SSLeay.c:11809: error: expected ‘=’, ‘,’, ‘;’, ‘asm’ or ‘__attribute__’ before ‘{’ token
SSLeay.c:11863: error: expected ‘=’, ‘,’, ‘;’, ‘asm’ or ‘__attribute__’ before ‘{’ token
SSLeay.c:11882: error: expected ‘=’, ‘,’, ‘;’, ‘asm’ or ‘__attribute__’ before ‘{’ token
SSLeay.c:11905: error: expected ‘=’, ‘,’, ‘;’, ‘asm’ or ‘__attribute__’ before ‘{’ token
SSLeay.c:11926: error: expected ‘=’, ‘,’, ‘;’, ‘asm’ or ‘__attribute__’ before ‘{’ token
SSLeay.c:11951: error: expected ‘=’, ‘,’, ‘;’, ‘asm’ or ‘__attribute__’ before ‘{’ token
SSLeay.c:11972: error: expected ‘=’, ‘,’, ‘;’, ‘asm’ or ‘__attribute__’ before ‘{’ token
SSLeay.c:11993: error: expected ‘=’, ‘,’, ‘;’, ‘asm’ or ‘__attribute__’ before ‘{’ token
SSLeay.c:12122: error: expected ‘=’, ‘,’, ‘;’, ‘asm’ or ‘__attribute__’ before ‘{’ token
SSLeay.c:12173: error: expected ‘=’, ‘,’, ‘;’, ‘asm’ or ‘__attribute__’ before ‘{’ token
SSLeay.c:12245: error: expected ‘=’, ‘,’, ‘;’, ‘asm’ or ‘__attribute__’ before ‘{’ token
SSLeay.c:12263: error: expected ‘=’, ‘,’, ‘;’, ‘asm’ or ‘__attribute__’ before ‘{’ token
SSLeay.c:12285: error: expected ‘=’, ‘,’, ‘;’, ‘asm’ or ‘__attribute__’ before ‘{’ token
SSLeay.c:12307: error: expected ‘=’, ‘,’, ‘;’, ‘asm’ or ‘__attribute__’ before ‘{’ token
SSLeay.c:12581: error: expected ‘=’, ‘,’, ‘;’, ‘asm’ or ‘__attribute__’ before ‘{’ token
SSLeay.c:12603: error: expected ‘=’, ‘,’, ‘;’, ‘asm’ or ‘__attribute__’ before ‘{’ token
SSLeay.c:13332: error: expected ‘=’, ‘,’, ‘;’, ‘asm’ or ‘__attribute__’ before ‘{’ token
SSLeay.c:13354: error: expected ‘=’, ‘,’, ‘;’, ‘asm’ or ‘__attribute__’ before ‘{’ token
SSLeay.c:13376: error: expected ‘=’, ‘,’, ‘;’, ‘asm’ or ‘__attribute__’ before ‘{’ token
SSLeay.c:13398: error: expected ‘=’, ‘,’, ‘;’, ‘asm’ or ‘__attribute__’ before ‘{’ token
SSLeay.c:13420: error: expected ‘=’, ‘,’, ‘;’, ‘asm’ or ‘__attribute__’ before ‘{’ token
SSLeay.c:13442: error: expected ‘=’, ‘,’, ‘;’, ‘asm’ or ‘__attribute__’ before ‘{’ token
SSLeay.c:13471: error: expected ‘=’, ‘,’, ‘;’, ‘asm’ or ‘__attribute__’ before ‘{’ token
SSLeay.c:13508: error: expected ‘=’, ‘,’, ‘;’, ‘asm’ or ‘__attribute__’ before ‘{’ token
SSLeay.c:13556: error: expected ‘=’, ‘,’, ‘;’, ‘asm’ or ‘__attribute__’ before ‘{’ token
SSLeay.c:13578: error: expected ‘=’, ‘,’, ‘;’, ‘asm’ or ‘__attribute__’ before ‘{’ token
SSLeay.c:13600: error: expected ‘=’, ‘,’, ‘;’, ‘asm’ or ‘__attribute__’ before ‘{’ token
SSLeay.c:13658: error: expected ‘=’, ‘,’, ‘;’, ‘asm’ or ‘__attribute__’ before ‘{’ token
SSLeay.c:13688: error: expected ‘=’, ‘,’, ‘;’, ‘asm’ or ‘__attribute__’ before ‘{’ token
SSLeay.c:13718: error: expected ‘=’, ‘,’, ‘;’, ‘asm’ or ‘__attribute__’ before ‘{’ token
SSLeay.c:13748: error: expected ‘=’, ‘,’, ‘;’, ‘asm’ or ‘__attribute__’ before ‘{’ token
SSLeay.c:13778: error: expected ‘=’, ‘,’, ‘;’, ‘asm’ or ‘__attribute__’ before ‘{’ token
SSLeay.c:13800: error: expected ‘=’, ‘,’, ‘;’, ‘asm’ or ‘__attribute__’ before ‘{’ token
SSLeay.c:13822: error: expected ‘=’, ‘,’, ‘;’, ‘asm’ or ‘__attribute__’ before ‘{’ token
SSLeay.c:13844: error: expected ‘=’, ‘,’, ‘;’, ‘asm’ or ‘__attribute__’ before ‘{’ token
SSLeay.c:13867: error: expected ‘=’, ‘,’, ‘;’, ‘asm’ or ‘__attribute__’ before ‘{’ token
SSLeay.c:14094: error: expected ‘=’, ‘,’, ‘;’, ‘asm’ or ‘__attribute__’ before ‘{’ token
SSLeay.c:14092: error: declaration for parameter ‘boot_Net__SSLeay’ but no such parameter
SSLeay.c:13865: error: declaration for parameter ‘XS_Net__SSLeay_P_X509_get_pubkey_alg’ but no such parameter
SSLeay.c:13842: error: declaration for parameter ‘XS_Net__SSLeay_P_X509_get_signature_alg’ but no such parameter
SSLeay.c:13820: error: declaration for parameter ‘XS_Net__SSLeay_X509_issuer_and_serial_hash’ but no such parameter
SSLeay.c:13798: error: declaration for parameter ‘XS_Net__SSLeay_X509_issuer_name_hash’ but no such parameter
SSLeay.c:13776: error: declaration for parameter ‘XS_Net__SSLeay_X509_subject_name_hash’ but no such parameter
SSLeay.c:13746: error: declaration for parameter ‘XS_Net__SSLeay_X509_NAME_digest’ but no such parameter
SSLeay.c:13716: error: declaration for parameter ‘XS_Net__SSLeay_X509_REQ_digest’ but no such parameter
SSLeay.c:13686: error: declaration for parameter ‘XS_Net__SSLeay_X509_CRL_digest’ but no such parameter
SSLeay.c:13656: error: declaration for parameter ‘XS_Net__SSLeay_X509_digest’ but no such parameter
SSLeay.c:13598: error: declaration for parameter ‘XS_Net__SSLeay_OBJ_cmp’ but no such parameter
SSLeay.c:13576: error: declaration for parameter ‘XS_Net__SSLeay_OBJ_sn2nid’ but no such parameter
SSLeay.c:13554: error: declaration for parameter ‘XS_Net__SSLeay_OBJ_ln2nid’ but no such parameter
SSLeay.c:13506: error: declaration for parameter ‘XS_Net__SSLeay_OBJ_txt2nid’ but no such parameter
SSLeay.c:13469: error: declaration for parameter ‘XS_Net__SSLeay_OBJ_obj2txt’ but no such parameter
SSLeay.c:13440: error: declaration for parameter ‘XS_Net__SSLeay_OBJ_txt2obj’ but no such parameter
SSLeay.c:13418: error: declaration for parameter ‘XS_Net__SSLeay_OBJ_obj2nid’ but no such parameter
SSLeay.c:13396: error: declaration for parameter ‘XS_Net__SSLeay_OBJ_nid2sn’ but no such parameter
SSLeay.c:13374: error: declaration for parameter ‘XS_Net__SSLeay_OBJ_nid2ln’ but no such parameter
SSLeay.c:13352: error: declaration for parameter ‘XS_Net__SSLeay_OBJ_nid2obj’ but no such parameter
SSLeay.c:13330: error: declaration for parameter ‘XS_Net__SSLeay_OBJ_dup’ but no such parameter
SSLeay.c:12601: error: declaration for parameter ‘XS_Net__SSLeay_OpenSSL_add_all_algorithms’ but no such parameter
SSLeay.c:12579: error: declaration for parameter ‘XS_Net__SSLeay_EVP_get_cipherbyname’ but no such parameter
SSLeay.c:12305: error: declaration for parameter ‘XS_Net__SSLeay_EVP_MD_size’ but no such parameter
SSLeay.c:12283: error: declaration for parameter ‘XS_Net__SSLeay_EVP_MD_type’ but no such parameter
SSLeay.c:12261: error: declaration for parameter ‘XS_Net__SSLeay_EVP_get_digestbyname’ but no such parameter
SSLeay.c:12243: error: declaration for parameter ‘XS_Net__SSLeay_OpenSSL_add_all_digests’ but no such parameter
SSLeay.c:12171: error: declaration for parameter ‘XS_Net__SSLeay_EVP_sha1’ but no such parameter
SSLeay.c:12120: error: declaration for parameter ‘XS_Net__SSLeay_EVP_add_digest’ but no such parameter
SSLeay.c:11991: error: declaration for parameter ‘XS_Net__SSLeay_get_keyblock_size’ but no such parameter
SSLeay.c:11970: error: declaration for parameter ‘XS_Net__SSLeay_get_server_random’ but no such parameter
SSLeay.c:11949: error: declaration for parameter ‘XS_Net__SSLeay_get_client_random’ but no such parameter
SSLeay.c:11924: error: declaration for parameter ‘XS_Net__SSLeay_SESSION_set_master_key’ but no such parameter
SSLeay.c:11903: error: declaration for parameter ‘XS_Net__SSLeay_SESSION_get_master_key’ but no such parameter
SSLeay.c:11880: error: declaration for parameter ‘XS_Net__SSLeay_total_renegotiations’ but no such parameter
SSLeay.c:11861: error: declaration for parameter ‘XS_Net__SSLeay_DH_free’ but no such parameter
SSLeay.c:11807: error: declaration for parameter ‘XS_Net__SSLeay_PEM_read_bio_PrivateKey’ but no such parameter
SSLeay.c:11764: error: declaration for parameter ‘XS_Net__SSLeay_PEM_read_bio_X509_REQ’ but no such parameter
SSLeay.c:11721: error: declaration for parameter ‘XS_Net__SSLeay_PEM_read_bio_X509’ but no such parameter
SSLeay.c:11678: error: declaration for parameter ‘XS_Net__SSLeay_PEM_read_bio_X509_CRL’ but no such parameter
SSLeay.c:11635: error: declaration for parameter ‘XS_Net__SSLeay_PEM_read_bio_DHparams’ but no such parameter
SSLeay.c:11606: error: declaration for parameter ‘XS_Net__SSLeay_d2i_X509_bio’ but no such parameter
SSLeay.c:11577: error: declaration for parameter ‘XS_Net__SSLeay_d2i_X509_REQ_bio’ but no such parameter
SSLeay.c:11548: error: declaration for parameter ‘XS_Net__SSLeay_d2i_X509_CRL_bio’ but no such parameter
SSLeay.c:11529: error: declaration for parameter ‘XS_Net__SSLeay_X509_free’ but no such parameter
SSLeay.c:11508: error: declaration for parameter ‘XS_Net__SSLeay_X509_new’ but no such parameter
SSLeay.c:11489: error: declaration for parameter ‘XS_Net__SSLeay_RSA_free’ but no such parameter
SSLeay.c:11446: error: declaration for parameter ‘XS_Net__SSLeay_RSA_generate_key’ but no such parameter
SSLeay.c:11422: error: declaration for parameter ‘XS_Net__SSLeay_set_tmp_rsa’ but no such parameter
SSLeay.c:11399: error: declaration for parameter ‘XS_Net__SSLeay_set_tmp_dh’ but no such parameter
SSLeay.c:11375: error: declaration for parameter ‘XS_Net__SSLeay_set_pref_cipher’ but no such parameter
SSLeay.c:11351: error: declaration for parameter ‘XS_Net__SSLeay_set_mode’ but no such parameter
SSLeay.c:11327: error: declaration for parameter ‘XS_Net__SSLeay_set_app_data’ but no such parameter
SSLeay.c:11303: error: declaration for parameter ‘XS_Net__SSLeay_SESSION_set_app_data’ but no such parameter
SSLeay.c:11280: error: declaration for parameter ‘XS_Net__SSLeay_session_reused’ but no such parameter
SSLeay.c:11257: error: declaration for parameter ‘XS_Net__SSLeay_SESSION_get_app_data’ but no such parameter
SSLeay.c:11234: error: declaration for parameter ‘XS_Net__SSLeay_num_renegotiations’ but no such parameter
SSLeay.c:11211: error: declaration for parameter ‘XS_Net__SSLeay_need_tmp_RSA’ but no such parameter
SSLeay.c:11188: error: declaration for parameter ‘XS_Net__SSLeay_get_state’ but no such parameter
SSLeay.c:11165: error: declaration for parameter ‘XS_Net__SSLeay_get_mode’ but no such parameter
SSLeay.c:11135: error: declaration for parameter ‘XS_Net__SSLeay_get_cipher_bits’ but no such parameter
SSLeay.c:11112: error: declaration for parameter ‘XS_Net__SSLeay_get_app_data’ but no such parameter
SSLeay.c:11089: error: declaration for parameter ‘XS_Net__SSLeay_CTX_set_tmp_rsa’ but no such parameter
SSLeay.c:11066: error: declaration for parameter ‘XS_Net__SSLeay_CTX_set_tmp_dh’ but no such parameter
SSLeay.c:11042: error: declaration for parameter ‘XS_Net__SSLeay_CTX_set_session_cache_mode’ but no such parameter
SSLeay.c:11018: error: declaration for parameter ‘XS_Net__SSLeay_CTX_set_read_ahead’ but no such parameter
SSLeay.c:10994: error: declaration for parameter ‘XS_Net__SSLeay_CTX_set_mode’ but no such parameter
SSLeay.c:10970: error: declaration for parameter ‘XS_Net__SSLeay_CTX_set_app_data’ but no such parameter
SSLeay.c:10947: error: declaration for parameter ‘XS_Net__SSLeay_CTX_need_tmp_RSA’ but no such parameter
SSLeay.c:10924: error: declaration for parameter ‘XS_Net__SSLeay_CTX_get_session_cache_mode’ but no such parameter
SSLeay.c:10901: error: declaration for parameter ‘XS_Net__SSLeay_CTX_get_read_ahead’ but no such parameter
SSLeay.c:10878: error: declaration for parameter ‘XS_Net__SSLeay_CTX_get_mode’ but no such parameter
SSLeay.c:10855: error: declaration for parameter ‘XS_Net__SSLeay_CTX_get_app_data’ but no such parameter
SSLeay.c:10831: error: declaration for parameter ‘XS_Net__SSLeay_CTX_add_extra_chain_cert’ but no such parameter
SSLeay.c:10808: error: declaration for parameter ‘XS_Net__SSLeay_clear_num_renegotiations’ but no such parameter
SSLeay.c:10781: error: declaration for parameter ‘XS_Net__SSLeay_SESSION_get_ex_new_index’ but no such parameter
SSLeay.c:10755: error: declaration for parameter ‘XS_Net__SSLeay_get_ex_new_index’ but no such parameter
SSLeay.c:10735: error: declaration for parameter ‘XS_Net__SSLeay_set_tmp_dh_callback’ but no such parameter
SSLeay.c:10715: error: declaration for parameter ‘XS_Net__SSLeay_CTX_set_tmp_dh_callback’ but no such parameter
SSLeay.c:10695: error: declaration for parameter ‘XS_Net__SSLeay_set_tmp_rsa_callback’ but no such parameter
SSLeay.c:10675: error: declaration for parameter ‘XS_Net__SSLeay_CTX_set_tmp_rsa_callback’ but no such parameter
SSLeay.c:10651: error: declaration for parameter ‘XS_Net__SSLeay_set_session_id_context’ but no such parameter
SSLeay.c:10627: error: declaration for parameter ‘XS_Net__SSLeay_CTX_set_session_id_context’ but no such parameter
SSLeay.c:10601: error: declaration for parameter ‘XS_Net__SSLeay_CTX_get_ex_new_index’ but no such parameter
SSLeay.c:10575: error: declaration for parameter ‘XS_Net__SSLeay_add_dir_cert_subjects_to_stack’ but no such parameter
SSLeay.c:10547: error: declaration for parameter ‘XS_Net__SSLeay_add_file_cert_subjects_to_stack’ but no such parameter
SSLeay.c:10525: error: declaration for parameter ‘XS_Net__SSLeay_load_client_CA_file’ but no such parameter
SSLeay.c:10502: error: declaration for parameter ‘XS_Net__SSLeay_version’ but no such parameter
SSLeay.c:10480: error: declaration for parameter ‘XS_Net__SSLeay_shutdown’ but no such parameter
SSLeay.c:10460: error: declaration for parameter ‘XS_Net__SSLeay_set_verify_result’ but no such parameter
SSLeay.c:10440: error: declaration for parameter ‘XS_Net__SSLeay_set_verify_depth’ but no such parameter
SSLeay.c:10417: error: declaration for parameter ‘XS_Net__SSLeay_set_trust’ but no such parameter
SSLeay.c:10397: error: declaration for parameter ‘XS_Net__SSLeay_set_shutdown’ but no such parameter
SSLeay.c:10377: error: declaration for parameter ‘XS_Net__SSLeay_set_quiet_shutdown’ but no such parameter
SSLeay.c:10354: error: declaration for parameter ‘XS_Net__SSLeay_set_purpose’ but no such parameter
SSLeay.c:10334: error: declaration for parameter ‘XS_Net__SSLeay_set_info_callback’ but no such parameter
SSLeay.c:10310: error: declaration for parameter ‘XS_Net__SSLeay_set_ex_data’ but no such parameter
SSLeay.c:10291: error: declaration for parameter ‘XS_Net__SSLeay_set_connect_state’ but no such parameter
SSLeay.c:10271: error: declaration for parameter ‘XS_Net__SSLeay_set_client_CA_list’ but no such parameter
SSLeay.c:10249: error: declaration for parameter ‘XS_Net__SSLeay_get_client_CA_list’ but no such parameter
SSLeay.c:10226: error: declaration for parameter ‘XS_Net__SSLeay_sk_X509_NAME_value’ but no such parameter
SSLeay.c:10204: error: declaration for parameter ‘XS_Net__SSLeay_sk_X509_NAME_num’ but no such parameter
SSLeay.c:10185: error: declaration for parameter ‘XS_Net__SSLeay_sk_X509_NAME_free’ but no such parameter
SSLeay.c:10166: error: declaration for parameter ‘XS_Net__SSLeay_set_accept_state’ but no such parameter
SSLeay.c:10143: error: declaration for parameter ‘XS_Net__SSLeay_SESSION_set_timeout’ but no such parameter
SSLeay.c:10120: error: declaration for parameter ‘XS_Net__SSLeay_SESSION_set_time’ but no such parameter
SSLeay.c:10096: error: declaration for parameter ‘XS_Net__SSLeay_SESSION_set_ex_data’ but no such parameter
SSLeay.c:10073: error: declaration for parameter ‘XS_Net__SSLeay_SESSION_print_fp’ but no such parameter
SSLeay.c:10051: error: declaration for parameter ‘XS_Net__SSLeay_SESSION_get_timeout’ but no such parameter
SSLeay.c:10029: error: declaration for parameter ‘XS_Net__SSLeay_SESSION_get_time’ but no such parameter
SSLeay.c:10006: error: declaration for parameter ‘XS_Net__SSLeay_SESSION_get_ex_data’ but no such parameter
SSLeay.c:9982: error: declaration for parameter ‘XS_Net__SSLeay_SESSION_cmp’ but no such parameter
SSLeay.c:9957: error: declaration for parameter ‘XS_Net__SSLeay_renegotiate’ but no such parameter
SSLeay.c:9935: error: declaration for parameter ‘XS_Net__SSLeay_get_verify_result’ but no such parameter
SSLeay.c:9913: error: declaration for parameter ‘XS_Net__SSLeay_get_verify_mode’ but no such parameter
SSLeay.c:9891: error: declaration for parameter ‘XS_Net__SSLeay_get_verify_depth’ but no such parameter
SSLeay.c:9869: error: declaration for parameter ‘XS_Net__SSLeay_get_shutdown’ but no such parameter
SSLeay.c:9847: error: declaration for parameter ‘XS_Net__SSLeay_get_quiet_shutdown’ but no such parameter
SSLeay.c:9823: error: declaration for parameter ‘XS_Net__SSLeay_get_peer_finished’ but no such parameter
SSLeay.c:9799: error: declaration for parameter ‘XS_Net__SSLeay_get_finished’ but no such parameter
SSLeay.c:9776: error: declaration for parameter ‘XS_Net__SSLeay_get_ex_data’ but no such parameter
SSLeay.c:9754: error: declaration for parameter ‘XS_Net__SSLeay_get_default_timeout’ but no such parameter
SSLeay.c:9732: error: declaration for parameter ‘XS_Net__SSLeay_get_current_cipher’ but no such parameter
SSLeay.c:9710: error: declaration for parameter ‘XS_Net__SSLeay_dup’ but no such parameter
SSLeay.c:9688: error: declaration for parameter ‘XS_Net__SSLeay_do_handshake’ but no such parameter
SSLeay.c:9665: error: declaration for parameter ‘XS_Net__SSLeay_CTX_use_RSAPrivateKey’ but no such parameter
SSLeay.c:9642: error: declaration for parameter ‘XS_Net__SSLeay_CTX_use_PrivateKey’ but no such parameter
SSLeay.c:9619: error: declaration for parameter ‘XS_Net__SSLeay_CTX_use_certificate_chain_file’ but no such parameter
SSLeay.c:9596: error: declaration for parameter ‘XS_Net__SSLeay_CTX_use_certificate’ but no such parameter
SSLeay.c:9576: error: declaration for parameter ‘XS_Net__SSLeay_CTX_set_verify_depth’ but no such parameter
SSLeay.c:9553: error: declaration for parameter ‘XS_Net__SSLeay_CTX_set_trust’ but no such parameter
SSLeay.c:9530: error: declaration for parameter ‘XS_Net__SSLeay_CTX_set_timeout’ but no such parameter
SSLeay.c:9480: error: declaration for parameter ‘XS_Net__SSLeay_CTX_set_ssl_version’ but no such parameter
SSLeay.c:9457: error: declaration for parameter ‘XS_Net__SSLeay_CTX_set_quiet_shutdown’ but no such parameter
SSLeay.c:9434: error: declaration for parameter ‘XS_Net__SSLeay_CTX_set_purpose’ but no such parameter
SSLeay.c:9410: error: declaration for parameter ‘XS_Net__SSLeay_CTX_set_ex_data’ but no such parameter
SSLeay.c:9377: error: declaration for parameter ‘XS_Net__SSLeay_CTX_set_default_passwd_cb_userdata’ but no such parameter
SSLeay.c:9341: error: declaration for parameter ‘XS_Net__SSLeay_CTX_set_default_passwd_cb’ but no such parameter
SSLeay.c:9321: error: declaration for parameter ‘XS_Net__SSLeay_CTX_set_client_CA_list’ but no such parameter
SSLeay.c:9299: error: declaration for parameter ‘XS_Net__SSLeay_CTX_get_client_CA_list’ but no such parameter
SSLeay.c:9258: error: declaration for parameter ‘XS_Net__SSLeay_CTX_set_cert_verify_callback’ but no such parameter
SSLeay.c:9236: error: declaration for parameter ‘XS_Net__SSLeay_CTX_get_cert_store’ but no such parameter
SSLeay.c:9216: error: declaration for parameter ‘XS_Net__SSLeay_CTX_set_cert_store’ but no such parameter
SSLeay.c:9194: error: declaration for parameter ‘XS_Net__SSLeay_CTX_get_verify_mode’ but no such parameter
SSLeay.c:9172: error: declaration for parameter ‘XS_Net__SSLeay_CTX_get_verify_depth’ but no such parameter
SSLeay.c:9150: error: declaration for parameter ‘XS_Net__SSLeay_CTX_get_timeout’ but no such parameter
SSLeay.c:9128: error: declaration for parameter ‘XS_Net__SSLeay_CTX_get_quiet_shutdown’ but no such parameter
SSLeay.c:9105: error: declaration for parameter ‘XS_Net__SSLeay_CTX_get_ex_data’ but no such parameter
SSLeay.c:9083: error: declaration for parameter ‘XS_Net__SSLeay_CTX_check_private_key’ but no such parameter
SSLeay.c:9059: error: declaration for parameter ‘XS_Net__SSLeay_CTX_callback_ctrl’ but no such parameter
SSLeay.c:9036: error: declaration for parameter ‘XS_Net__SSLeay_CTX_add_client_CA’ but no such parameter
SSLeay.c:9013: error: declaration for parameter ‘XS_Net__SSLeay_COMP_add_compression_method’ but no such parameter
SSLeay.c:8929: error: declaration for parameter ‘XS_Net__SSLeay_CIPHER_get_bits’ but no such parameter
SSLeay.c:8907: error: declaration for parameter ‘XS_Net__SSLeay_CIPHER_get_name’ but no such parameter
SSLeay.c:8851: error: declaration for parameter ‘XS_Net__SSLeay_CIPHER_description’ but no such parameter
SSLeay.c:8825: error: declaration for parameter ‘XS_Net__SSLeay_check_private_key’ but no such parameter
SSLeay.c:8801: error: declaration for parameter ‘XS_Net__SSLeay_callback_ctrl’ but no such parameter
SSLeay.c:8779: error: declaration for parameter ‘XS_Net__SSLeay_alert_type_string_long’ but no such parameter
SSLeay.c:8757: error: declaration for parameter ‘XS_Net__SSLeay_alert_type_string’ but no such parameter
SSLeay.c:8735: error: declaration for parameter ‘XS_Net__SSLeay_alert_desc_string_long’ but no such parameter
SSLeay.c:8713: error: declaration for parameter ‘XS_Net__SSLeay_alert_desc_string’ but no such parameter
SSLeay.c:8690: error: declaration for parameter ‘XS_Net__SSLeay_add_client_CA’ but no such parameter
SSLeay.c:8671: error: declaration for parameter ‘XS_Net__SSLeay_BIO_ssl_shutdown’ but no such parameter
SSLeay.c:8648: error: declaration for parameter ‘XS_Net__SSLeay_BIO_ssl_copy_session_id’ but no such parameter
SSLeay.c:8626: error: declaration for parameter ‘XS_Net__SSLeay_BIO_wpending’ but no such parameter
SSLeay.c:8604: error: declaration for parameter ‘XS_Net__SSLeay_BIO_pending’ but no such parameter
SSLeay.c:8582: error: declaration for parameter ‘XS_Net__SSLeay_BIO_eof’ but no such parameter
SSLeay.c:8555: error: declaration for parameter ‘XS_Net__SSLeay_BIO_write’ but no such parameter
SSLeay.c:8520: error: declaration for parameter ‘XS_Net__SSLeay_BIO_read’ but no such parameter
SSLeay.c:8498: error: declaration for parameter ‘XS_Net__SSLeay_BIO_free’ but no such parameter
SSLeay.c:8476: error: declaration for parameter ‘XS_Net__SSLeay_BIO_new’ but no such parameter
SSLeay.c:8454: error: declaration for parameter ‘XS_Net__SSLeay_BIO_new_ssl_connect’ but no such parameter
SSLeay.c:8431: error: declaration for parameter ‘XS_Net__SSLeay_BIO_new_ssl’ but no such parameter
SSLeay.c:8408: error: declaration for parameter ‘XS_Net__SSLeay_BIO_new_file’ but no such parameter
SSLeay.c:8386: error: declaration for parameter ‘XS_Net__SSLeay_BIO_new_buffer_ssl_connect’ but no such parameter
SSLeay.c:8363: error: declaration for parameter ‘XS_Net__SSLeay_get_ssl_method’ but no such parameter
SSLeay.c:8313: error: declaration for parameter ‘XS_Net__SSLeay_set_ssl_method’ but no such parameter
SSLeay.c:8289: error: declaration for parameter ‘XS_Net__SSLeay_TLSv1_method’ but no such parameter
SSLeay.c:8268: error: declaration for parameter ‘XS_Net__SSLeay_SSLv3_method’ but no such parameter
SSLeay.c:8245: error: declaration for parameter ‘XS_Net__SSLeay_SSLv2_method’ but no such parameter
SSLeay.c:8148: error: declaration for parameter ‘XS_Net__SSLeay_SHA1’ but no such parameter
SSLeay.c:8085: error: declaration for parameter ‘XS_Net__SSLeay_MD5’ but no such parameter
SSLeay.c:8057: error: declaration for parameter ‘XS_Net__SSLeay_MD4’ but no such parameter
SSLeay.c:8026: error: declaration for parameter ‘XS_Net__SSLeay_MD2’ but no such parameter
SSLeay.c:7946: error: declaration for parameter ‘XS_Net__SSLeay_P_PKCS12_load_file’ but no such parameter
SSLeay.c:7887: error: declaration for parameter ‘XS_Net__SSLeay_CTX_use_PKCS12_file’ but no such parameter
SSLeay.c:7822: error: declaration for parameter ‘XS_Net__SSLeay_PEM_get_string_PrivateKey’ but no such parameter
SSLeay.c:7785: error: declaration for parameter ‘XS_Net__SSLeay_PEM_get_string_X509_CRL’ but no such parameter
SSLeay.c:7748: error: declaration for parameter ‘XS_Net__SSLeay_PEM_get_string_X509_REQ’ but no such parameter
SSLeay.c:7711: error: declaration for parameter ‘XS_Net__SSLeay_PEM_get_string_X509’ but no such parameter
SSLeay.c:7663: error: declaration for parameter ‘XS_Net__SSLeay_EVP_PKEY_size’ but no such parameter
SSLeay.c:7641: error: declaration for parameter ‘XS_Net__SSLeay_EVP_PKEY_bits’ but no such parameter
SSLeay.c:7618: error: declaration for parameter ‘XS_Net__SSLeay_EVP_PKEY_assign_RSA’ but no such parameter
SSLeay.c:7599: error: declaration for parameter ‘XS_Net__SSLeay_EVP_PKEY_free’ but no such parameter
SSLeay.c:7578: error: declaration for parameter ‘XS_Net__SSLeay_EVP_PKEY_new’ but no such parameter
SSLeay.c:7555: error: declaration for parameter ‘XS_Net__SSLeay_EVP_PKEY_copy_parameters’ but no such parameter
SSLeay.c:7408: error: declaration for parameter ‘XS_Net__SSLeay_P_ASN1_TIME_put2string’ but no such parameter
SSLeay.c:7387: error: declaration for parameter ‘XS_Net__SSLeay_ASN1_TIME_new’ but no such parameter
SSLeay.c:7368: error: declaration for parameter ‘XS_Net__SSLeay_ASN1_TIME_free’ but no such parameter
SSLeay.c:7345: error: declaration for parameter ‘XS_Net__SSLeay_ASN1_TIME_set’ but no such parameter
SSLeay.c:7322: error: declaration for parameter ‘XS_Net__SSLeay_X509_gmtime_adj’ but no such parameter
SSLeay.c:7300: error: declaration for parameter ‘XS_Net__SSLeay_X509_get_notAfter’ but no such parameter
SSLeay.c:7278: error: declaration for parameter ‘XS_Net__SSLeay_X509_get_notBefore’ but no such parameter
SSLeay.c:7243: error: declaration for parameter ‘XS_Net__SSLeay_P_ASN1_STRING_get’ but no such parameter
SSLeay.c:7209: error: declaration for parameter ‘XS_Net__SSLeay_P_ASN1_INTEGER_get_dec’ but no such parameter
SSLeay.c:7175: error: declaration for parameter ‘XS_Net__SSLeay_P_ASN1_INTEGER_get_hex’ but no such parameter
SSLeay.c:7143: error: declaration for parameter ‘XS_Net__SSLeay_P_ASN1_INTEGER_set_dec’ but no such parameter
SSLeay.c:7111: error: declaration for parameter ‘XS_Net__SSLeay_P_ASN1_INTEGER_set_hex’ but no such parameter
SSLeay.c:7089: error: declaration for parameter ‘XS_Net__SSLeay_ASN1_INTEGER_get’ but no such parameter
SSLeay.c:7066: error: declaration for parameter ‘XS_Net__SSLeay_ASN1_INTEGER_set’ but no such parameter
SSLeay.c:7047: error: declaration for parameter ‘XS_Net__SSLeay_ASN1_INTEGER_free’ but no such parameter
SSLeay.c:7026: error: declaration for parameter ‘XS_Net__SSLeay_ASN1_INTEGER_new’ but no such parameter
SSLeay.c:7004: error: declaration for parameter ‘XS_Net__SSLeay_X509_verify_cert_error_string’ but no such parameter
SSLeay.c:6980: error: declaration for parameter ‘XS_Net__SSLeay_X509_load_cert_crl_file’ but no such parameter
SSLeay.c:6956: error: declaration for parameter ‘XS_Net__SSLeay_X509_load_crl_file’ but no such parameter
SSLeay.c:6932: error: declaration for parameter ‘XS_Net__SSLeay_X509_load_cert_file’ but no such parameter
SSLeay.c:6822: error: declaration for parameter ‘XS_Net__SSLeay_X509_STORE_add_crl’ but no such parameter
SSLeay.c:6799: error: declaration for parameter ‘XS_Net__SSLeay_X509_STORE_add_cert’ but no such parameter
SSLeay.c:6779: error: declaration for parameter ‘XS_Net__SSLeay_X509_STORE_CTX_set_cert’ but no such parameter
SSLeay.c:6759: error: declaration for parameter ‘XS_Net__SSLeay_X509_STORE_CTX_set_error’ but no such parameter
SSLeay.c:6735: error: declaration for parameter ‘XS_Net__SSLeay_X509_STORE_CTX_set_ex_data’ but no such parameter
SSLeay.c:6713: error: declaration for parameter ‘XS_Net__SSLeay_X509_STORE_CTX_get_error_depth’ but no such parameter
SSLeay.c:6691: error: declaration for parameter ‘XS_Net__SSLeay_X509_STORE_CTX_get_error’ but no such parameter
SSLeay.c:6669: error: declaration for parameter ‘XS_Net__SSLeay_X509V3_EXT_d2i’ but no such parameter
SSLeay.c:6613: error: declaration for parameter ‘XS_Net__SSLeay_X509V3_EXT_print’ but no such parameter
SSLeay.c:6591: error: declaration for parameter ‘XS_Net__SSLeay_X509_get_ext_count’ but no such parameter
SSLeay.c:6569: error: declaration for parameter ‘XS_Net__SSLeay_X509_EXTENSION_get_object’ but no such parameter
SSLeay.c:6547: error: declaration for parameter ‘XS_Net__SSLeay_X509_EXTENSION_get_data’ but no such parameter
SSLeay.c:6525: error: declaration for parameter ‘XS_Net__SSLeay_X509_EXTENSION_get_critical’ but no such parameter
SSLeay.c:6502: error: declaration for parameter ‘XS_Net__SSLeay_X509_get_ext’ but no such parameter
SSLeay.c:6472: error: declaration for parameter ‘XS_Net__SSLeay_X509_get_ext_by_NID’ but no such parameter
SSLeay.c:6436: error: declaration for parameter ‘XS_Net__SSLeay_P_X509_get_netscape_cert_type’ but no such parameter
SSLeay.c:6399: error: declaration for parameter ‘XS_Net__SSLeay_P_X509_get_key_usage’ but no such parameter
SSLeay.c:6201: error: declaration for parameter ‘XS_Net__SSLeay_X509_get_subjectAltNames’ but no such parameter
SSLeay.c:6142: error: declaration for parameter ‘XS_Net__SSLeay_X509_get_fingerprint’ but no such parameter
SSLeay.c:6119: error: declaration for parameter ‘XS_Net__SSLeay_X509_STORE_CTX_get_ex_data’ but no such parameter
SSLeay.c:6097: error: declaration for parameter ‘XS_Net__SSLeay_X509_STORE_CTX_get_current_cert’ but no such parameter
SSLeay.c:6040: error: declaration for parameter ‘XS_Net__SSLeay_P_X509_copy_extensions’ but no such parameter
SSLeay.c:5989: error: declaration for parameter ‘XS_Net__SSLeay_P_X509_add_extensions’ but no such parameter
SSLeay.c:5942: error: declaration for parameter ‘XS_Net__SSLeay_P_X509_REQ_add_extensions’ but no such parameter
SSLeay.c:5868: error: declaration for parameter ‘XS_Net__SSLeay_X509_REQ_add1_attr_by_NID’ but no such parameter
SSLeay.c:5838: error: declaration for parameter ‘XS_Net__SSLeay_X509_REQ_get_attr_by_OBJ’ but no such parameter
SSLeay.c:5808: error: declaration for parameter ‘XS_Net__SSLeay_X509_REQ_get_attr_by_NID’ but no such parameter
SSLeay.c:5786: error: declaration for parameter ‘XS_Net__SSLeay_X509_REQ_get_attr_count’ but no such parameter
SSLeay.c:5764: error: declaration for parameter ‘XS_Net__SSLeay_X509_REQ_get_version’ but no such parameter
SSLeay.c:5741: error: declaration for parameter ‘XS_Net__SSLeay_X509_REQ_set_version’ but no such parameter
SSLeay.c:5718: error: declaration for parameter ‘XS_Net__SSLeay_X509_REQ_verify’ but no such parameter
SSLeay.c:5694: error: declaration for parameter ‘XS_Net__SSLeay_X509_REQ_sign’ but no such parameter
SSLeay.c:5672: error: declaration for parameter ‘XS_Net__SSLeay_X509_REQ_get_pubkey’ but no such parameter
SSLeay.c:5649: error: declaration for parameter ‘XS_Net__SSLeay_X509_REQ_set_pubkey’ but no such parameter
SSLeay.c:5626: error: declaration for parameter ‘XS_Net__SSLeay_X509_REQ_set_subject_name’ but no such parameter
SSLeay.c:5604: error: declaration for parameter ‘XS_Net__SSLeay_X509_REQ_get_subject_name’ but no such parameter
SSLeay.c:5585: error: declaration for parameter ‘XS_Net__SSLeay_X509_REQ_free’ but no such parameter
SSLeay.c:5564: error: declaration for parameter ‘XS_Net__SSLeay_X509_REQ_new’ but no such parameter
SSLeay.c:5401: error: declaration for parameter ‘XS_Net__SSLeay_X509_CRL_sign’ but no such parameter
SSLeay.c:5378: error: declaration for parameter ‘XS_Net__SSLeay_X509_CRL_verify’ but no such parameter
SSLeay.c:5356: error: declaration for parameter ‘XS_Net__SSLeay_X509_CRL_get_nextUpdate’ but no such parameter
SSLeay.c:5334: error: declaration for parameter ‘XS_Net__SSLeay_X509_CRL_get_lastUpdate’ but no such parameter
SSLeay.c:5312: error: declaration for parameter ‘XS_Net__SSLeay_X509_CRL_get_issuer’ but no such parameter
SSLeay.c:5290: error: declaration for parameter ‘XS_Net__SSLeay_X509_CRL_get_version’ but no such parameter
SSLeay.c:5150: error: declaration for parameter ‘XS_Net__SSLeay_X509_CRL_new’ but no such parameter
SSLeay.c:5131: error: declaration for parameter ‘XS_Net__SSLeay_X509_CRL_free’ but no such parameter
SSLeay.c:5109: error: declaration for parameter ‘XS_Net__SSLeay_X509_NAME_ENTRY_get_object’ but no such parameter
SSLeay.c:5087: error: declaration for parameter ‘XS_Net__SSLeay_X509_NAME_ENTRY_get_data’ but no such parameter
SSLeay.c:5064: error: declaration for parameter ‘XS_Net__SSLeay_X509_NAME_get_entry’ but no such parameter
SSLeay.c:5042: error: declaration for parameter ‘XS_Net__SSLeay_X509_NAME_entry_count’ but no such parameter
SSLeay.c:5019: error: declaration for parameter ‘XS_Net__SSLeay_X509_NAME_cmp’ but no such parameter
SSLeay.c:4852: error: declaration for parameter ‘XS_Net__SSLeay_X509_NAME_get_text_by_NID’ but no such parameter
SSLeay.c:4797: error: declaration for parameter ‘XS_Net__SSLeay_X509_NAME_print_ex’ but no such parameter
SSLeay.c:4770: error: declaration for parameter ‘XS_Net__SSLeay_X509_NAME_oneline’ but no such parameter
SSLeay.c:4747: error: declaration for parameter ‘XS_Net__SSLeay_X509_verify’ but no such parameter
SSLeay.c:4723: error: declaration for parameter ‘XS_Net__SSLeay_X509_sign’ but no such parameter
SSLeay.c:4694: error: declaration for parameter ‘XS_Net__SSLeay_X509_certificate_type’ but no such parameter
SSLeay.c:4671: error: declaration for parameter ‘XS_Net__SSLeay_X509_set_serialNumber’ but no such parameter
SSLeay.c:4649: error: declaration for parameter ‘XS_Net__SSLeay_X509_get_serialNumber’ but no such parameter
SSLeay.c:4627: error: declaration for parameter ‘XS_Net__SSLeay_X509_get_pubkey’ but no such parameter
SSLeay.c:4605: error: declaration for parameter ‘XS_Net__SSLeay_X509_get_version’ but no such parameter
SSLeay.c:4582: error: declaration for parameter ‘XS_Net__SSLeay_X509_set_pubkey’ but no such parameter
SSLeay.c:4559: error: declaration for parameter ‘XS_Net__SSLeay_X509_set_version’ but no such parameter
SSLeay.c:4536: error: declaration for parameter ‘XS_Net__SSLeay_X509_set_subject_name’ but no such parameter
SSLeay.c:4513: error: declaration for parameter ‘XS_Net__SSLeay_X509_set_issuer_name’ but no such parameter
SSLeay.c:4491: error: declaration for parameter ‘XS_Net__SSLeay_X509_get_subject_name’ but no such parameter
SSLeay.c:4469: error: declaration for parameter ‘XS_Net__SSLeay_X509_get_issuer_name’ but no such parameter
SSLeay.c:4446: error: declaration for parameter ‘XS_Net__SSLeay_RAND_egd’ but no such parameter
SSLeay.c:4424: error: declaration for parameter ‘XS_Net__SSLeay_RAND_write_file’ but no such parameter
SSLeay.c:4401: error: declaration for parameter ‘XS_Net__SSLeay_RAND_load_file’ but no such parameter
SSLeay.c:4383: error: declaration for parameter ‘XS_Net__SSLeay_RAND_cleanup’ but no such parameter
SSLeay.c:4360: error: declaration for parameter ‘XS_Net__SSLeay_RAND_seed’ but no such parameter
SSLeay.c:4328: error: declaration for parameter ‘XS_Net__SSLeay_RAND_file_name’ but no such parameter
SSLeay.c:4305: error: declaration for parameter ‘XS_Net__SSLeay_RAND_egd_bytes’ but no such parameter
SSLeay.c:4284: error: declaration for parameter ‘XS_Net__SSLeay_RAND_status’ but no such parameter
SSLeay.c:4263: error: declaration for parameter ‘XS_Net__SSLeay_RAND_poll’ but no such parameter
SSLeay.c:4238: error: declaration for parameter ‘XS_Net__SSLeay_RAND_add’ but no such parameter
SSLeay.c:4206: error: declaration for parameter ‘XS_Net__SSLeay_RAND_pseudo_bytes’ but no such parameter
SSLeay.c:4174: error: declaration for parameter ‘XS_Net__SSLeay_RAND_bytes’ but no such parameter
SSLeay.c:4156: error: declaration for parameter ‘XS_Net__SSLeay_ERR_load_RAND_strings’ but no such parameter
SSLeay.c:4138: error: declaration for parameter ‘XS_Net__SSLeay_ERR_load_SSL_strings’ but no such parameter
SSLeay.c:4019: error: declaration for parameter ‘XS_Net__SSLeay_library_init’ but no such parameter
SSLeay.c:3980: error: declaration for parameter ‘XS_Net__SSLeay_FIPS_mode_set’ but no such parameter
SSLeay.c:3962: error: declaration for parameter ‘XS_Net__SSLeay_ERR_load_crypto_strings’ but no such parameter
SSLeay.c:3944: error: declaration for parameter ‘XS_Net__SSLeay_load_error_strings’ but no such parameter
SSLeay.c:3914: error: declaration for parameter ‘XS_Net__SSLeay_ERR_error_string’ but no such parameter
SSLeay.c:3896: error: declaration for parameter ‘XS_Net__SSLeay_ERR_clear_error’ but no such parameter
SSLeay.c:3873: error: declaration for parameter ‘XS_Net__SSLeay_ERR_put_error’ but no such parameter
SSLeay.c:3852: error: declaration for parameter ‘XS_Net__SSLeay_ERR_peek_error’ but no such parameter
SSLeay.c:3831: error: declaration for parameter ‘XS_Net__SSLeay_ERR_get_error’ but no such parameter
SSLeay.c:3810: error: declaration for parameter ‘XS_Net__SSLeay_BIO_s_mem’ but no such parameter
SSLeay.c:3789: error: declaration for parameter ‘XS_Net__SSLeay_BIO_f_ssl’ but no such parameter
SSLeay.c:3645: error: declaration for parameter ‘XS_Net__SSLeay_state’ but no such parameter
SSLeay.c:3623: error: declaration for parameter ‘XS_Net__SSLeay_want’ but no such parameter
SSLeay.c:3600: error: declaration for parameter ‘XS_Net__SSLeay_CTX_sess_set_cache_size’ but no such parameter
SSLeay.c:3578: error: declaration for parameter ‘XS_Net__SSLeay_CTX_sess_get_cache_size’ but no such parameter
SSLeay.c:3556: error: declaration for parameter ‘XS_Net__SSLeay_CTX_sess_cache_full’ but no such parameter
SSLeay.c:3534: error: declaration for parameter ‘XS_Net__SSLeay_CTX_sess_timeouts’ but no such parameter
SSLeay.c:3512: error: declaration for parameter ‘XS_Net__SSLeay_CTX_sess_misses’ but no such parameter
SSLeay.c:3490: error: declaration for parameter ‘XS_Net__SSLeay_CTX_sess_cb_hits’ but no such parameter
SSLeay.c:3468: error: declaration for parameter ‘XS_Net__SSLeay_CTX_sess_hits’ but no such parameter
SSLeay.c:3446: error: declaration for parameter ‘XS_Net__SSLeay_CTX_sess_accept_good’ but no such parameter
SSLeay.c:3424: error: declaration for parameter ‘XS_Net__SSLeay_CTX_sess_accept_renegotiate’ but no such parameter
SSLeay.c:3402: error: declaration for parameter ‘XS_Net__SSLeay_CTX_sess_accept’ but no such parameter
SSLeay.c:3380: error: declaration for parameter ‘XS_Net__SSLeay_CTX_sess_connect_renegotiate’ but no such parameter
SSLeay.c:3358: error: declaration for parameter ‘XS_Net__SSLeay_CTX_sess_connect_good’ but no such parameter
SSLeay.c:3336: error: declaration for parameter ‘XS_Net__SSLeay_CTX_sess_connect’ but no such parameter
SSLeay.c:3314: error: declaration for parameter ‘XS_Net__SSLeay_CTX_sess_number’ but no such parameter
SSLeay.c:3288: error: declaration for parameter ‘XS_Net__SSLeay_CTX_sessions’ but no such parameter
SSLeay.c:3237: error: declaration for parameter ‘XS_Net__SSLeay_CTX_set_options’ but no such parameter
SSLeay.c:3215: error: declaration for parameter ‘XS_Net__SSLeay_CTX_get_options’ but no such parameter
SSLeay.c:3192: error: declaration for parameter ‘XS_Net__SSLeay_set_options’ but no such parameter
SSLeay.c:3170: error: declaration for parameter ‘XS_Net__SSLeay_get_options’ but no such parameter
SSLeay.c:3145: error: declaration for parameter ‘XS_Net__SSLeay_CTX_ctrl’ but no such parameter
SSLeay.c:3048: error: declaration for parameter ‘XS_Net__SSLeay_get_certificate’ but no such parameter
SSLeay.c:3026: error: declaration for parameter ‘XS_Net__SSLeay_get1_session’ but no such parameter
SSLeay.c:3003: error: declaration for parameter ‘XS_Net__SSLeay_get_session’ but no such parameter
SSLeay.c:2950: error: declaration for parameter ‘XS_Net__SSLeay_d2i_SSL_SESSION’ but no such parameter
SSLeay.c:2923: error: declaration for parameter ‘XS_Net__SSLeay_set_session’ but no such parameter
SSLeay.c:2900: error: declaration for parameter ‘XS_Net__SSLeay_i2d_SSL_SESSION’ but no such parameter
SSLeay.c:2881: error: declaration for parameter ‘XS_Net__SSLeay_SESSION_free’ but no such parameter
SSLeay.c:2858: error: declaration for parameter ‘XS_Net__SSLeay_SESSION_print’ but no such parameter
SSLeay.c:2837: error: declaration for parameter ‘XS_Net__SSLeay_SESSION_new’ but no such parameter
SSLeay.c:2815: error: declaration for parameter ‘XS_Net__SSLeay_get_wbio’ but no such parameter
SSLeay.c:2793: error: declaration for parameter ‘XS_Net__SSLeay_get_rbio’ but no such parameter
SSLeay.c:2772: error: declaration for parameter ‘XS_Net__SSLeay_set_bio’ but no such parameter
SSLeay.c:2743: error: declaration for parameter ‘XS_Net__SSLeay_set_verify’ but no such parameter
SSLeay.c:2721: error: declaration for parameter ‘XS_Net__SSLeay_get_peer_certificate’ but no such parameter
SSLeay.c:2682: error: declaration for parameter ‘XS_Net__SSLeay_get_shared_ciphers’ but no such parameter
SSLeay.c:2660: error: declaration for parameter ‘XS_Net__SSLeay_get_cipher’ but no such parameter
SSLeay.c:2637: error: declaration for parameter ‘XS_Net__SSLeay_set_cipher_list’ but no such parameter
SSLeay.c:2614: error: declaration for parameter ‘XS_Net__SSLeay_get_cipher_list’ but no such parameter
SSLeay.c:2591: error: declaration for parameter ‘XS_Net__SSLeay_CTX_set_cipher_list’ but no such parameter
SSLeay.c:2569: error: declaration for parameter ‘XS_Net__SSLeay_pending’ but no such parameter
SSLeay.c:2547: error: declaration for parameter ‘XS_Net__SSLeay_get_read_ahead’ but no such parameter
SSLeay.c:2521: error: declaration for parameter ‘XS_Net__SSLeay_set_read_ahead’ but no such parameter
SSLeay.c:2501: error: declaration for parameter ‘XS_Net__SSLeay_copy_session_id’ but no such parameter
SSLeay.c:2478: error: declaration for parameter ‘XS_Net__SSLeay_set_timeout’ but no such parameter
SSLeay.c:2456: error: declaration for parameter ‘XS_Net__SSLeay_get_timeout’ but no such parameter
SSLeay.c:2433: error: declaration for parameter ‘XS_Net__SSLeay_set_time’ but no such parameter
SSLeay.c:2411: error: declaration for parameter ‘XS_Net__SSLeay_get_time’ but no such parameter
SSLeay.c:2389: error: declaration for parameter ‘XS_Net__SSLeay_rstate_string_long’ but no such parameter
SSLeay.c:2367: error: declaration for parameter ‘XS_Net__SSLeay_state_string_long’ but no such parameter
SSLeay.c:2345: error: declaration for parameter ‘XS_Net__SSLeay_rstate_string’ but no such parameter
SSLeay.c:2323: error: declaration for parameter ‘XS_Net__SSLeay_state_string’ but no such parameter
SSLeay.c:2299: error: declaration for parameter ‘XS_Net__SSLeay_CTX_use_certificate_file’ but no such parameter
SSLeay.c:2275: error: declaration for parameter ‘XS_Net__SSLeay_use_certificate_file’ but no such parameter
SSLeay.c:2251: error: declaration for parameter ‘XS_Net__SSLeay_use_certificate_ASN1’ but no such parameter
SSLeay.c:2228: error: declaration for parameter ‘XS_Net__SSLeay_use_certificate’ but no such parameter
SSLeay.c:2204: error: declaration for parameter ‘XS_Net__SSLeay_CTX_use_PrivateKey_file’ but no such parameter
SSLeay.c:2180: error: declaration for parameter ‘XS_Net__SSLeay_use_PrivateKey_file’ but no such parameter
SSLeay.c:2155: error: declaration for parameter ‘XS_Net__SSLeay_use_PrivateKey_ASN1’ but no such parameter
SSLeay.c:2132: error: declaration for parameter ‘XS_Net__SSLeay_use_PrivateKey’ but no such parameter
SSLeay.c:2108: error: declaration for parameter ‘XS_Net__SSLeay_CTX_use_RSAPrivateKey_file’ but no such parameter
SSLeay.c:2084: error: declaration for parameter ‘XS_Net__SSLeay_use_RSAPrivateKey_file’ but no such parameter
SSLeay.c:2060: error: declaration for parameter ‘XS_Net__SSLeay_use_RSAPrivateKey_ASN1’ but no such parameter
SSLeay.c:2037: error: declaration for parameter ‘XS_Net__SSLeay_use_RSAPrivateKey’ but no such parameter
SSLeay.c:1992: error: declaration for parameter ‘XS_Net__SSLeay_write_partial’ but no such parameter
SSLeay.c:1965: error: declaration for parameter ‘XS_Net__SSLeay_write’ but no such parameter
SSLeay.c:1930: error: declaration for parameter ‘XS_Net__SSLeay_peek’ but no such parameter
SSLeay.c:1877: error: declaration for parameter ‘XS_Net__SSLeay_read’ but no such parameter
SSLeay.c:1855: error: declaration for parameter ‘XS_Net__SSLeay_get_fd’ but no such parameter
SSLeay.c:1825: error: declaration for parameter ‘XS_Net__SSLeay_set_wfd’ but no such parameter
SSLeay.c:1796: error: declaration for parameter ‘XS_Net__SSLeay_set_rfd’ but no such parameter
SSLeay.c:1767: error: declaration for parameter ‘XS_Net__SSLeay_set_fd’ but no such parameter
SSLeay.c:1649: error: declaration for parameter ‘XS_Net__SSLeay_connect’ but no such parameter
SSLeay.c:1630: error: declaration for parameter ‘XS_Net__SSLeay_clear’ but no such parameter
SSLeay.c:1608: error: declaration for parameter ‘XS_Net__SSLeay_accept’ but no such parameter
SSLeay.c:1564: error: declaration for parameter ‘XS_Net__SSLeay_free’ but no such parameter
SSLeay.c:1542: error: declaration for parameter ‘XS_Net__SSLeay_new’ but no such parameter
SSLeay.c:1518: error: declaration for parameter ‘XS_Net__SSLeay_get_error’ but no such parameter
SSLeay.c:1477: error: declaration for parameter ‘XS_Net__SSLeay_CTX_set_verify’ but no such parameter
SSLeay.c:1449: error: declaration for parameter ‘XS_Net__SSLeay_CTX_load_verify_locations’ but no such parameter
SSLeay.c:1427: error: declaration for parameter ‘XS_Net__SSLeay_CTX_set_default_verify_paths’ but no such parameter
SSLeay.c:1407: error: declaration for parameter ‘XS_Net__SSLeay_CTX_flush_sessions’ but no such parameter
SSLeay.c:1384: error: declaration for parameter ‘XS_Net__SSLeay_CTX_remove_session’ but no such parameter
SSLeay.c:1361: error: declaration for parameter ‘XS_Net__SSLeay_CTX_add_session’ but no such parameter
SSLeay.c:1340: error: declaration for parameter ‘XS_Net__SSLeay_CTX_free’ but no such parameter
SSLeay.c:1317: error: declaration for parameter ‘XS_Net__SSLeay_CTX_new_with_method’ but no such parameter
SSLeay.c:1295: error: declaration for parameter ‘XS_Net__SSLeay_CTX_tlsv1_new’ but no such parameter
SSLeay.c:1273: error: declaration for parameter ‘XS_Net__SSLeay_CTX_v23_new’ but no such parameter
SSLeay.c:1251: error: declaration for parameter ‘XS_Net__SSLeay_CTX_v3_new’ but no such parameter
SSLeay.c:1227: error: declaration for parameter ‘XS_Net__SSLeay_CTX_v2_new’ but no such parameter
SSLeay.c:1201: error: declaration for parameter ‘XS_Net__SSLeay_CTX_new’ but no such parameter
SSLeay.c:1172: error: declaration for parameter ‘XS_Net__SSLeay_SSLeay_version’ but no such parameter
SSLeay.c:1151: error: declaration for parameter ‘XS_Net__SSLeay_SSLeay’ but no such parameter
SSLeay.c:1127: error: declaration for parameter ‘XS_Net__SSLeay_hello’ but no such parameter
SSLeay.c:1103: error: declaration for parameter ‘XS_Net__SSLeay_constant’ but no such parameter
SSLeay.c:1077: error: declaration for parameter ‘XS_Net__SSLeay_CLONE’ but no such parameter
SSLeay.xs:422: error: declaration for parameter ‘simple_cb_data_t’ but no such parameter
SSLeay.xs:359: error: declaration for parameter ‘perl_filehandle_t’ but no such parameter
SSLeay.c:14876: error: expected ‘{’ at end of input
make: *** [SSLeay.o] Error 1
  MIKEM/Net-SSLeay-1.54.tar.gz
  /usr/bin/make -- NOT OK
Warning (usually harmless): 'YAML' not installed, will not store persistent state
Running make test
  Can't test without successful make
Running make install
  Make had returned bad status, install seems impossible
[root ~]# 

Open in new window

0
Comment
Question by:Xetroximyn
  • 2
4 Comments
 
LVL 5

Expert Comment

by:SmartIntel
ID: 39223103
You can use the yum to check which versions are installed:

yum list perl

perl.x86_64                     4:5.8.8-40.el5_9                                                  installed

yum  list openssl

openssl.x86_64            0.9.8e-26.el5_9.1                                                    installed
0
 

Author Comment

by:Xetroximyn
ID: 39223122
Thanks!

I need to know what compiler and options were used to compile them.  Will having the versions tell me that?
0
 
LVL 28

Accepted Solution

by:
FishMonger earned 500 total points
ID: 39223234
To find out which compiler and options used to compile perl, you run this command:
perl -V

Open in new window


I don't know how to check openssl.

As a starting point, I'd install YAML which is the first issue reported.

Do you have the openssl devel libs installed?  If not, you'll need them before installing NET::SSLeay.
0
 

Author Comment

by:Xetroximyn
ID: 39223277
Thanks!  I needed openssl-devel -- I am able to install SSLeay from CPAN now.
0

Featured Post

Is Your Active Directory as Secure as You Think?

More than 75% of all records are compromised because of the loss or theft of a privileged credential. Experts have been exploring Active Directory infrastructure to identify key threats and establish best practices for keeping data safe. Attend this month’s webinar to learn more.

Question has a verified solution.

If you are experiencing a similar issue, please ask a related question

Suggested Solutions

Title # Comments Views Activity
AWS EC2 Linux 1 54
IIS Log files on Exchange 2013 server 6 80
Scripted configuration of TightVNC with Start on boot 7 51
Linux Copy Command - All Files inc Directory 1 23
Little introduction about CP: CP is a command on linux that use to copy files and folder from one location to another location. Example usage of CP as follow: cp /myfoder /pathto/destination/folder/ cp abc.tar.gz /pathto/destination/folder/ab…
Summary: This tutorial covers some basics of pointer, pointer arithmetic and function pointer. What is a pointer: A pointer is a variable which holds an address. This address might be address of another variable/address of devices/address of fu…
Video by: Grant
The goal of this video is to provide viewers with basic examples to understand and use nested-loops in the C programming language.
Connecting to an Amazon Linux EC2 Instance from Windows Using PuTTY.

914 members asked questions and received personalized solutions in the past 7 days.

Join the community of 500,000 technology professionals and ask your questions.

Join & Ask a Question

Need Help in Real-Time?

Connect with top rated Experts

18 Experts available now in Live!

Get 1:1 Help Now